{"text_format":"1","workbook":"xlsx","n_sheets":7,"sheets":["Instructions","AS Data","Dashboard","Checks","Queries","Lists","Analysis"],"not_rendered":{"charts":0,"images":0,"macros":1,"external_links":0,"defined_names":17,"comments":0,"pivot_tables":0},"unopened":[],"bounds":{"document_bytes":16777216,"sheet_cells":100000,"rows_first":2000,"rows_last":500,"rows_between":2000,"halvings":0,"cell_chars":16384,"cell_head_chars":4096},"cells_cut":0,"cells_raw":0,"read":"whole","date_system":"1900"}

{"sheet":"Instructions","index":0,"n_rows":24,"n_cols":10,"rows_kept":24,"cut":false,"hidden":false,"merged":[[23,1,23,4],[21,1,21,4],[22,1,22,4],[3,9,3,15],[5,9,5,15],[7,9,7,15],[19,1,19,5]]}
[]
[null,"ADOPTION SUPPORT DATA COLLECTION"]
[]
[null,"Reporting period to which the data relates to: ",null,null,null,null,null,null,null,"2025/26 Q1 and Q2 Pilot"]
[]
[null,"Please enter the email address of the person completing this return:"]
[]
[null,"Please select the name of your agency:"]
[]
[]
[null,"INSTRUCTIONS"]
[]
[null,"The 'DATA'  tab is where you should paste (as values) the child/young person-level adoption support you are planning to submit for the data collection period"]
[null,"When you have added your data, press the 'CHECK DATA' button on the top left corner of the 'AS Data' sheet"]
[null,"A log of the queries raised can be found in the 'Queries' sheet. This log will be freshly generated each time you go to the \"Queries\" sheet if any changes have been made to your data."]
{"$rows_left_out":10}
{"sheet":"AS Data","index":1,"n_rows":202,"n_cols":46,"rows_kept":202,"cut":false,"hidden":false,"merged":[[2,0,2,6],[2,7,2,16]]}
[]
[]
["THE CHILD",null,null,null,null,null,null,"ADOPTION SUPPORT KEY DATES"]
["C1","C2","C3","C4","C5","C6","C7","C8","C9","C10","C11","C12","C13","C14","C15","C16","C17","A1","B1","B2","B3","B4","B5","B6","B7","B8","B9","B10","B11","B12","B13","B14","B15","B16","B17","A2","A3","A4","A5","A6","A7","A8","A9","A10","A11","A12"]
["LA Code  of Responsible  Local Authority","Child/Young Person  Identifier","Contact Identifier","Date of birth","Gender Identity","Ethnic Origin","Is the child/young person  classed as being disabled (0=No, 1=Yes)","Date the ADM approves an adoptive match for the child/young person \n(PRE ORDER)","Date child/young person was placed with the adoptive family\n(PRE ORDER)","Date of Adoption Order","Date of adoption support contact\n(POST ORDER)","Date service contacted family and allocated support\n(POST ORDER)","Date 'Adoption Support Needs Assessment' started\n(POST ORDER)","Date 'Adoption Support Needs Assessment' completed\n(POST ORDER)","Date of most recent 'Adoption Support Needs Assessment' review","Has the child/young person been referred into Children's Social Care (0=No, 1=Yes)\n(POST ORDER)","Date Case Closed","Pre- or post-order case (flag)",{"$f":"_xlfn.XLOOKUP(S$4,Checks!$A$23:$A$47,Checks!$B$23:$B$47,\"\",0,1)","v":"C1"},{"$f":"_xlfn.XLOOKUP(T$4,Checks!$A$23:$A$47,Checks!$B$23:$B$47,\"\",0,1)","v":"C2"},{"$f":"_xlfn.XLOOKUP(U$4,Checks!$A$23:$A$47,Checks!$B$23:$B$47,\"\",0,1)","v":"C3"},{"$f":"_xlfn.XLOOKUP(V$4,Checks!$A$23:$A$47,Checks!$B$23:$B$47,\"\",0,1)","v":"C4"},{"$f":"_xlfn.XLOOKUP(W$4,Checks!$A$23:$A$47,Checks!$B$23:$B$47,\"\",0,1)","v":"C5"},{"$f":"_xlfn.XLOOKUP(X$4,Checks!$A$23:$A$47,Checks!$B$23:$B$47,\"\",0,1)","v":"C6"},{"$f":"_xlfn.XLOOKUP(Y$4,Checks!$A$23:$A$47,Checks!$B$23:$B$47,\"\",0,1)","v":"C7"},{"$f":"_xlfn.XLOOKUP(Z$4,Checks!$A$23:$A$47,Checks!$B$23:$B$47,\"\",0,1)","v":"C8"},{"$f":"_xlfn.XLOOKUP(AA$4,Checks!$A$23:$A$47,Checks!$B$23:$B$47,\"\",0,1)","v":"C9"},{"$f":"_xlfn.XLOOKUP(AB$4,Checks!$A$23:$A$47,Checks!$B$23:$B$47,\"\",0,1)","v":"C10"},{"$f":"_xlfn.XLOOKUP(AC$4,Checks!$A$23:$A$47,Checks!$B$23:$B$47,\"\",0,1)","v":"C11"},{"$f":"_xlfn.XLOOKUP(AD$4,Checks!$A$23:$A$47,Checks!$B$23:$B$47,\"\",0,1)","v":"C12"},{"$f":"_xlfn.XLOOKUP(AE$4,Checks!$A$23:$A$47,Checks!$B$23:$B$47,\"\",0,1)","v":"C13"},{"$f":"_xlfn.XLOOKUP(AF$4,Checks!$A$23:$A$47,Checks!$B$23:$B$47,\"\",0,1)","v":"C14"},{"$f":"_xlfn.XLOOKUP(AG$4,Checks!$A$23:$A$47,Checks!$B$23:$B$47,\"\",0,1)","v":"C15"},{"$f":"_xlfn.XLOOKUP(AH$4,Checks!$A$23:$A$47,Checks!$B$23:$B$47,\"\",0,1)","v":"C16"},{"$f":"_xlfn.XLOOKUP(AI$4,Checks!$A$23:$A$47,Checks!$B$23:$B$47,\"\",0,1)","v":"C17"},"Time from match to case closed","Time from match to review","Case open or closed?","Time from contact to allocation","Time from allocation to assessment","Time to complete assessment","Time from contact to closure","Age at report date","Age at AO","Age when case closed","In reporting period"]
[null,null,null,null,null,null,null,null,null,null,null,null,null,null,null,null,null,{"$f":"IF(AND(OR(H6<>\"\",I6<>\"\"),COUNTA(A6:G6)>0),\"Pre\",IF(COUNT(K6:Q6)>0,\"Post\",\"\"))","v":""},{"$f":"IF(R6<>\"\",IF(OR(A6=\"\",ISNA(MATCH(A6,LA_URN,0))),\"Please record a valid LA URN\",\"\"),\"\")","v":""},{"$f":"IF(R6<>\"\",IF(B6=\"\",\"Please record the child's CMS ID\",\"\"),\"\")","v":""},{"$f":"IF(R6<>\"\",IF(C6=\"\",\"Please record a unique identifier for this case\",IF(COUNTIF($C$6:$C$100000,C6)>1,\"The contact identifier must be unique - please correct this case or other cases that have the same contact identifier recorded\",\"\")),\"\")","v":""},{"$f":"IF(R6<>\"\",IF(D6=\"\",\"Please record the date of birth for this child\",IF(OR(D6>TODAY(),NOT(ISNUMBER(D6))),\"Please enter a valid date for the date of birth\",IF(D6>RDate,\"Please enter a date that is not after the reporting period\",IF(DATEDIF(D6,RDate,\"y\")>=25,\"Cases for individuals aged 25 or over should not be included in this data return\",IF(D6>MIN(H6:O6,Q6),\"Date of birth cannot be after any of the dates in the adoption journey - please correct whichever dates are wrong\",\"\"))))),\"\")","v":""},{"$f":"IF(R6<>\"\",IF(OR(E6=\"\",ISNA(MATCH(E6,Gender_list,0))),\"Please record a valid gender code\",\"\"),\"\")","v":""},{"$f":"IF(R6<>\"\",IF(OR(F6=\"\",ISNA(MATCH(F6,Eth_list,0))),\"Please record a valid ethnicity code\",\"\"),\"\")","v":""},{"$f":"IF(R6<>\"\",IF(OR(G6=\"\",AND(G6<>0,G6<>1)),\"Please record a valid Disability code\",\"\"),\"\")","v":""},{"$f":"IF(H6<>\"\",IF(OR(H6>TODAY(),NOT(ISNUMBER(H6))),\"Please enter a valid date\",IF(H6<D6,\"The adoptive match cannot have been approved before the child was born\",IF(H6>RDate,\"This date indicates that the adoptive match was approved after the reporting period, so this case should not be included in the return\",IF(AND(I6=\"\",J6=\"\",OR(H6<SDate,I6>RDate)),\"This date falls outside the reporting period, so this case should not be included in the return\",\"\")))),IF(AND(I6<>\"\",ISNUMBER(I6)),\"This date is missing, please add it\",\"\"))","v":""},{"$f":"IF(I6=\"\",IF(AND(J6<>\"\",H6<>\"\"),\"Date is missing, please add it\",\"\"),IF(OR(I6>TODAY(),NOT(ISNUMBER(I6))),\"Please enter a valid date\",IF(I6<H6,\"Placement date cannot be before date match was approved - please correct either C8 or C9\",IF(AND(J6=\"\",OR(I6<SDate,I6>RDate)),\"This case falls outside the reporting period and so does not need to be included in this data return\",IF(I6>RDate,\"Date recorded is after reporting period, so this case does not need to be included in this data return\",\"\")))))","v":""},{"$f":"IF(AND(COUNT(K6:N6,Q6)>0,J6=\"\"),\"Date is missing, please add it\",IF(J6<>\"\",IF(OR(J6>TODAY(),NOT(ISNUMBER(J6))),\"Please enter a valid date\",IF(AND(I6<>\"\",ISNUMBER(I6),I6>J6),\"Date of AO cannot be before placement date - please correct either C9 or C10\",IF(AND(K6<>\"\",ISNUMBER(K6),J6>K6),\"Date of AO cannot be after post-order contact - please correct C10 or C11\",IF(OR(J6>RDate,AND(J6<SDate,R6=\"Pre\")),\"This case falls outside the reporting period and so does not need to be included in this data return\",\"\")))),\"\"))","v":""},{"$f":"IF(K6=\"\",IF(OR(R6=\"Post\",COUNT(L6:N6,Q6)>0),\"Date is missing, please add it\",\"\"),IF(OR(K6>TODAY(),NOT(ISNUMBER(K6))),\"Please enter a valid date\",IF(K6<J6,\"Contact date cannot be before Date of AO - please correct either C10 or C11\",IF(AND(R6=\"Post\",COUNT(L6:N6,P6:Q6)=0,OR(K6<SDate,K6>RDate)),\"Date of contact is outside the reporting period, so this record should not be included in this data return\",IF(K6>RDate,\"Date of contact is after the reporting period, so this record should ont be included in this data record\",\"\")))))","v":""},{"$f":"IF(L6=\"\",IF(COUNT(M6:N6,Q6)>0,\"Date is missing, please add it\",\"\"),IF(OR(L6>TODAY(),NOT(ISNUMBER(L6))),\"Please enter a valid date\",IF(L6<K6,\"Allocation date cannot be before Contact - please correct either C11 or C12\",\"\")))","v":""},{"$f":"IF(M6=\"\",IF(COUNT(N6,Q6)>0,\"Date is missing, please add it\",\"\"),IF(OR(M6>TODAY(),NOT(ISNUMBER(M6))),\"Please enter a valid date\",IF(M6<L6,\"Assessment start date cannot be before allocation date - please correct either C12 or C13\",\"\")))","v":""},{"$f":"IF(N6=\"\",IF(COUNT(Q6)>0,\"Date is missing, please add it\",\"\"),IF(OR(N6>TODAY(),NOT(ISNUMBER(N6))),\"Please enter a valid date\",IF(N6<M6,\"Assessment cannot be completed before it is started - please correct either C13 or C14\",\"\")))","v":""},{"$f":"IF(O6=\"\",IF(OR(AND(I6<>\"\",OR(IFERROR(DATEDIF(I6,J6,\"y\"),0)>=1,IFERROR(DATEDIF(I6,RDate,\"y\"),0)>=1)),AND(N6<>\"\",OR(IFERROR(DATEDIF(N6,Q6,\"y\"),0)>=1,IFERROR(DATEDIF(N6,RDate,\"y\"),0)>=1))),\"Date appears to be missing - please record the date of review\",\"\"),IF(OR(O6>TODAY(),NOT(ISNUMBER(O6))),\"Please enter a valid date\",IF(AND(N6<>\"\",O6<N6),\"Review date cannot be before assessment was completed - please correct either C14 or C15\",IF(AND(Q6<>\"\",O6>Q6),\"Review date cannot be after case was closed - please correct either C15 or C17\",IF(AND(I6<>\"\",O6<I6),\"Review date cannot be before date of placement - please correct either C9 or C15\",IF(AND(J6<>\"\",O6>J6,I6<>\"\"),\"Review date cannot be after date of AO - please correct either C10 or C15\",\"\"))))))","v":""},{"$f":"IF(AND(P6<>\"\",P6<>0,P6<>1),\"Please record a valid code\",\"\")","v":""},{"$f":"IF(Q6<>\"\",IF(OR(Q6>TODAY(),NOT(ISNUMBER(Q6))),\"Please enter a valid date\",IF(AND(O6<>\"\",ISNUMBER(O6),O6>Q6),\"Closure date cannot be earlier than the latest Review - please correct either C15 or C17\",IF(AND(K6<>\"\",ISNUMBER(K6),K6>Q6),\"Closure date cannot be earlier than the initial contact date - please correct C11 or C17\",IF(Q6<SDate,\"Case was closed before reporting period and so does not need to be included in this data return\",\"\")))),\"\")","v":""},{"$f":"IF(AND(H6<>\"\",J6<>\"\",ISNUMBER(H6),ISNUMBER(J6)),J6-H6,\"\")","v":""},{"$f":"IF(AND(H6<>\"\",O6<>\"\",ISNUMBER(H6),ISNUMBER(O6)),O6-H6,\"\")","v":""},{"$f":"IF(R6<>\"\",IF(OR(AND(R6=\"Post\",Q6<>\"\",Q6<RDate),AND(R6=\"Pre\",J6<>\"\",J6<RDate)),\"Closed\",\"Open\"),\"\")","v":""},{"$f":"IF(AND(K6<>\"\",L6<>\"\",ISNUMBER(K6),ISNUMBER(L6)),L6-K6,\"\")","v":""},{"$f":"IF(AND(L6<>\"\",M6<>\"\",ISNUMBER(L6),ISNUMBER(M6)),M6-L6,\"\")","v":""},{"$f":"IF(AND(M6<>\"\",N6<>\"\",ISNUMBER(M6),ISNUMBER(N6)),N6-M6,\"\")","v":""},{"$f":"IF(AND(K6<>\"\",Q6<>\"\",ISNUMBER(K6),ISNUMBER(Q6)),Q6-K6,\"\")","v":""},{"$f":"IF(D6<>\"\",DATEDIF(D6,RDate,\"y\"),\"\")","v":""},{"$f":"IF(D6<>\"\",DATEDIF(D6,J6,\"y\"),\"\")","v":""},{"$f":"IF(D6<>\"\",DATEDIF(D6,Q6,\"y\"),\"\")","v":""},{"$f":"NOT(OR(AND(K6<>\"\",K6>RDate),AND(Q6<>\"\",Q6<SDate)))","v":{"$error":"#NAME?"}}]
[null,null,null,null,null,null,null,null,null,null,null,null,null,null,null,null,null,{"$f":"IF(AND(OR(H7<>\"\",I7<>\"\"),COUNTA(A7:G7)>0),\"Pre\",IF(COUNT(K7:Q7)>0,\"Post\",\"\"))","v":""},"",{"$f":"IF(R7<>\"\",IF(B7=\"\",\"Please record the child's CMS ID\",\"\"),\"\")","v":""},{"$f":"IF(R7<>\"\",IF(C7=\"\",\"Please record a unique identifier for this case\",IF(COUNTIF($C$6:$C$100000,C7)>1,\"The contact identifier must be unique - please correct this case or other cases that have the same contact identifier recorded\",\"\")),\"\")","v":""},"","","",{"$f":"IF(R7<>\"\",IF(OR(G7=\"\",AND(G7<>0,G7<>1)),\"Please record a valid Disability code\",\"\"),\"\")","v":""},"","","","",{"$f":"IF(L7=\"\",IF(COUNT(M7:N7,Q7)>0,\"Date is missing, please add it\",\"\"),IF(OR(L7>TODAY(),NOT(ISNUMBER(L7))),\"Please enter a valid date\",IF(L7<K7,\"Allocation date cannot be before Contact - please correct either C11 or C12\",\"\")))","v":""},{"$f":"IF(M7=\"\",IF(COUNT(N7,Q7)>0,\"Date is missing, please add it\",\"\"),IF(OR(M7>TODAY(),NOT(ISNUMBER(M7))),\"Please enter a valid date\",IF(M7<L7,\"Assessment start date cannot be before allocation date - please correct either C12 or C13\",\"\")))","v":""},{"$f":"IF(N7=\"\",IF(COUNT(Q7)>0,\"Date is missing, please add it\",\"\"),IF(OR(N7>TODAY(),NOT(ISNUMBER(N7))),\"Please enter a valid date\",IF(N7<M7,\"Assessment cannot be completed before it is started - please correct either C13 or C14\",\"\")))","v":""},"",{"$f":"IF(AND(P7<>\"\",P7<>0,P7<>1),\"Please record a valid code\",\"\")","v":""},"",{"$f":"IF(AND(H7<>\"\",J7<>\"\",ISNUMBER(H7),ISNUMBER(J7)),J7-H7,\"\")","v":""},{"$f":"IF(AND(H7<>\"\",O7<>\"\",ISNUMBER(H7),ISNUMBER(O7)),O7-H7,\"\")","v":""},"",{"$f":"IF(AND(K7<>\"\",L7<>\"\",ISNUMBER(K7),ISNUMBER(L7)),L7-K7,\"\")","v":""},{"$f":"IF(AND(L7<>\"\",M7<>\"\",ISNUMBER(L7),ISNUMBER(M7)),M7-L7,\"\")","v":""},{"$f":"IF(AND(M7<>\"\",N7<>\"\",ISNUMBER(M7),ISNUMBER(N7)),N7-M7,\"\")","v":""},{"$f":"IF(AND(K7<>\"\",Q7<>\"\",ISNUMBER(K7),ISNUMBER(Q7)),Q7-K7,\"\")","v":""},"",{"$f":"IF(D7<>\"\",DATEDIF(D7,J7,\"y\"),\"\")","v":""},{"$f":"IF(D7<>\"\",DATEDIF(D7,Q7,\"y\"),\"\")","v":""},{"$error":"#NAME?"}]
[null,null,null,null,null,null,null,null,null,null,null,null,null,null,null,null,null,"","","","","","","","","","","","","","","","","","","","","","","","","","","","",{"$error":"#NAME?"}]
[null,null,null,null,null,null,null,null,null,null,null,null,null,null,null,null,null,"","","","","","","","","","","","","","","","","","","","","","","","","","","","",{"$error":"#NAME?"}]
[null,null,null,null,null,null,null,null,null,null,null,null,null,null,null,null,null,"","","","","","","","","","","","","","","","","","","","","","","","","","","","",{"$error":"#NAME?"}]
[null,null,null,null,null,null,null,null,null,null,null,null,null,null,null,null,null,"","","","","","","","","","","","","","","","","","","","","","","","","","","","",{"$error":"#NAME?"}]
[null,null,null,null,null,null,null,null,null,null,null,null,null,null,null,null,null,"","","","","","","","","","","","","","","","","","","","","","","","","","","","",{"$error":"#NAME?"}]
[null,null,null,null,null,null,null,null,null,null,null,null,null,null,null,null,null,"","","","","","","","","","","","","","","","","","","","","","","","","","","","",{"$error":"#NAME?"}]
[null,null,null,null,null,null,null,null,null,null,null,null,null,null,null,null,null,"","","","","","","","","","","","","","","","","","","","","","","","","","","","",{"$error":"#NAME?"}]
[null,null,null,null,null,null,null,null,null,null,null,null,null,null,null,null,null,"","","","","","","","","","","","","","","","","","","","","","","","","","","","",{"$error":"#NAME?"}]
{"$rows_left_out":188}
{"sheet":"Dashboard","index":2,"n_rows":104,"n_cols":5,"rows_kept":104,"cut":false,"hidden":false,"merged":[]}
["HEADLINE MEASURES FOR DASHBOARD AND ANALYSIS"]
[]
["PRE ADOPTION ORDERSUPPORT",null,null,"POST ADOPTION ORDER SUPPORT"]
[]
["Number of children with an adoption support plan in place at ADM match (for matches approved in reporting period)",{"$f":"COUNTIFS('AS Data'!$R$6:$R$700000,\"Pre\",'AS Data'!$H$6:$H$700000,\"<=\"&RDate,'AS Data'!$H$6:$H$700000,\">=\"&SDate)","v":0},null,"Number of children for whom an adoption support contact has been made in reporting period",{"$f":"COUNTIFS('AS Data'!$R$6:$R$700000,\"Post\",'AS Data'!$K$6:$K$700000,\"<=\"&RDate,'AS Data'!$K$6:$K$700000,\">=\"&SDate)","v":0}]
["Number of children with an adoption support plan in place at placement (for placements in reporting period)",{"$f":"COUNTIFS('AS Data'!$R$6:$R$700000,\"Pre\",'AS Data'!$I$6:$I$700000,\"<=\"&RDate,'AS Data'!$I$6:$I$700000,\">=\"&SDate)","v":0},null,"Number of children for whom the service has contacted family and allocated support in reporting period",{"$f":"COUNTIFS('AS Data'!$R$6:$R$700000,\"Post\",'AS Data'!$L$6:$L$700000,\"<=\"&RDate,'AS Data'!$L$6:$L$700000,\">=\"&SDate)","v":0}]
["Number of children who had an adoption support needs assessment review in reporting period",{"$f":"COUNTIFS('AS Data'!$R$6:$R$700000,\"Pre\",'AS Data'!$O$6:$O$700000,\"<=\"&RDate,'AS Data'!$O$6:$O$700000,\">=\"&SDate)","v":0},null,"Number of children for whom an adoption support needs assessment started in reporting period",{"$f":"COUNTIFS('AS Data'!$R$6:$R$700000,\"Post\",'AS Data'!$M$6:$M$700000,\"<=\"&RDate,'AS Data'!$M$6:$M$700000,\">=\"&SDate)","v":0}]
["Number of children for whom an adoption support contact was closed in reporting period",{"$f":"COUNTIFS('AS Data'!$R$6:$R$700000,\"Pre\",'AS Data'!$J$6:$J$700000,\"<=\"&RDate,'AS Data'!$J$6:$J$700000,\">=\"&SDate)","v":0},null,"Number of children for whom an adoption support needs assessment completed in reporting period",{"$f":"COUNTIFS('AS Data'!$R$6:$R$700000,\"Post\",'AS Data'!$N$6:$N$700000,\"<=\"&RDate,'AS Data'!$N$6:$N$700000,\">=\"&SDate)","v":0}]
[null,null,null,"Number of children who had an adoption support needs assessment review in reporting period",{"$f":"COUNTIFS('AS Data'!$R$6:$R$700000,\"Post\",'AS Data'!$O$6:$O$700000,\"<=\"&RDate,'AS Data'!$O$6:$O$700000,\">=\"&SDate)","v":0}]
["Average time from date of adoption adoption support plan in place at ADM match to case closed (for cases closed in reporting period)",{"$f":"IFERROR(SUMIFS('AS Data'!$AJ$6:$AJ$700000,'AS Data'!$R$6:$R$700000,\"Pre\",'AS Data'!$J$6:$J$700000,\"<=\"&RDate,'AS Data'!$J$6:$J$700000,\">=\"&SDate)/$B$8&\" days\",\"-\")","v":"-"},null,"Number of children who were referred into Children's Social Care",{"$f":"COUNTIFS('AS Data'!$R$6:$R$700000,\"Post\",'AS Data'!$P$6:$P$700000,1,'AS Data'!$AT$6:$AT$700000,TRUE)","v":0}]
["Average time from date of adoption adoption support plan in place at ADM match to Adoption Support Needs Assessment review (for reviews in reporting period)",{"$f":"IFERROR(SUMIFS('AS Data'!$AK$6:$AK$700000,'AS Data'!$R$6:$R$700000,\"Pre\",'AS Data'!$O$6:$O$700000,\"<=\"&RDate,'AS Data'!$O$6:$O$700000,\">=\"&SDate)/$B$8&\" days\",\"-\")","v":"-"},null,"Number of children for whom an adoption support contact was closed in reporting period",{"$f":"COUNTIFS('AS Data'!$R$6:$R$700000,\"Post\",'AS Data'!$Q$6:$Q$700000,\"<=\"&RDate,'AS Data'!$Q$6:$Q$700000,\">=\"&SDate)","v":0}]
[]
[null,null,null,"Average time from date of adoption support contact to allocated to service for assessment (allocated in reporting period)",{"$f":"IFERROR(TEXT(SUMIFS('AS Data'!$AM$6:$AM$700000,'AS Data'!$R$6:$R$700000,\"Post\",'AS Data'!$L$6:$L$700000,\"<=\"&RDate,'AS Data'!$L$6:$L$700000,\">=\"&SDate)/E6,\"0.0\")&\" days\",\"\")","v":""}]
[null,null,null,"Average time from allocated to service for assessment to support needs assessment started (started in reporting period)",{"$f":"IFERROR(TEXT(SUMIFS('AS Data'!$AN$6:$AN$700000,'AS Data'!$R$6:$R$700000,\"Post\",'AS Data'!$M$6:$M$700000,\"<=\"&RDate,'AS Data'!$M$6:$M$700000,\">=\"&SDate)/E7,\"0.0\")&\" days\",\"\")","v":""}]
[null,null,null,"Average time from support needs assessment started to support needs assessment completed (completed in reporting period)",{"$f":"IFERROR(TEXT(SUMIFS('AS Data'!$AO$6:$AO$700000,'AS Data'!$R$6:$R$700000,\"Post\",'AS Data'!$N$6:$N$700000,\"<=\"&RDate,'AS Data'!$N$6:$N$700000,\">=\"&SDate)/E8,\"0.0\")&\" days\",\"\")","v":""}]
{"$rows_left_out":90}
{"sheet":"Checks","index":3,"n_rows":51,"n_cols":4,"rows_kept":51,"cut":false,"hidden":false,"merged":[]}
[]
[]
["DATA FIELD","PRE ADOPTION ORDER","POST ADOPTION ORDER"]
["C1","Compulsory","Compulsory"]
["C2","Compulsory","Compulsory"]
["C3","Compulsory","Compulsory"]
["C4","Compulsory","Compulsory"]
["C5","Compulsory","Compulsory"]
["C6","Compulsory","Compulsory"]
["C7","Compulsory","Compulsory"]
["C8","Compulsory","leave blank"]
["C9","sequentially","leave blank"]
["C10","sequentially","Compulsory"]
["C11","leave blank","sequentially"]
["C12","leave blank","sequentially"]
{"$rows_left_out":37}
{"sheet":"Queries","index":4,"n_rows":1,"n_cols":3,"rows_kept":1,"cut":false,"hidden":false,"merged":[]}
["Contact ID","Field ID","Query"]

{"sheet":"Lists","index":5,"n_rows":153,"n_cols":20,"rows_kept":153,"cut":false,"hidden":false,"merged":[]}
["LA CODE","LA Name",null,"Agency URN","Agency Name",null,"Gender Code","Gender Identity Description",null,"Ethnic Code","Ethnicity Description",null,"Disability Code","Disability Description",null,"SC Referred Code","Referred into Social Care",null,"Reporting year","Reporting Quarter"]
[301,"Barking and Dagenham",null,"RAA32","Adopt Birmingham",null,0,"Not known (gender not recorded )",null,"ABAN","Asian Bangladeshi",null,0,"No",null,0,"No",null,"2025-09-30","2025/26 Q1 and Q2 Pilot"]
[302,"Barnet",null,"RAA31","Adopt Coast to Coast",null,1,"Male",null,"AIND","Asian Indian",null,1,"Yes",null,1,"Yes",null,"2026-03-31","2025/26 Q4"]
[370,"Barnsley",null,"RAA26","Adopt East",null,2,"Female",null,"AOTH","Any other Asian background",null,null,null,null,null,null,null,"2027-03-31","2026/27 Q4"]
[800,"Bath and North East Somerset",null,"RAA20","Adopt London East",null,3,"Non-binary",null,"APKN","Asian Pakistani",null,null,null,null,null,null,null,"2028-03-31","2027/28 Q4"]
[822,"Bedford",null,"RAA22","Adopt London North",null,4,"Transgender Man (Trans Man)",null,"BAFR","Black African",null,null,null,null,null,null,null,"2029-03-31","2028/29 Q4"]
[303,"Bexley",null,"RAA19","Adopt London South",null,5,"Transgender Woman (Trans Woman)",null,"BCRB","Black Caribbean",null,null,null,null,null,null,null,"2030-03-31","2029/30 Q4"]
["213B","Bi-Borough",null,"RAA21","Adopt London West",null,6,"Other gender identity",null,"BOTH","Any other Black background"]
[330,"Birmingham",null,"RAA12","Adopt North East",null,7,"Gender identity the same as sex registered at birth but no specific identity given",null,"CHNE","Chinese"]
[889,"Blackburn with Darwen",null,"RAA14","Adopt South",null,8,"Gender identity different from sex registered at birth but no specific identity given",null,"MOTH","Any other mixed background"]
[890,"Blackpool",null,"RAA11","Adopt South West",null,9,"Neither",null,"MWAS","Mixed White and Asian"]
[350,"Bolton",null,"RAA6","Adopt Thames Valley",null,null,null,null,"MWBA","Mixed White and Black African"]
[837,"Bournemouth, Christchurch, Poole",null,"RAA15","Adoption @ Heart",null,null,null,null,"MWBC","Mixed White and Black Caribbean"]
[867,"Bracknell Forest",null,"RAA8","Adoption Central England",null,null,null,null,"NOBT","Information not yet obtained"]
[380,"Bradford",null,"RAA16","Adoption Connects",null,null,null,null,"OOTH","Any other ethnic group"]
{"$rows_left_out":139}
{"sheet":"Analysis","index":6,"n_rows":2,"n_cols":1,"rows_kept":2,"cut":false,"hidden":false,"merged":[]}
[{"$f":"_xlfn.XLOOKUP(Instructions!J4,Lists!$T$2:$T$7,Lists!$S$2:$S$7,\"\",0,1)","v":{"$error":"#NAME?"}}]
[{"$f":"IF(MONTH(RDate)=3,DATE(YEAR(RDate)-1,4,1),DATE(YEAR(RDate),4,1))","v":{"$error":"#NAME?"}}]