{"text_format":"1","workbook":"xlsx","n_sheets":10,"sheets":["Instructions","INSTRUCTIONS DATA EXPORT","Data","Dashboard","Queries","Glossary","URN","Analysis","Checks","Lists"],"not_rendered":{"charts":16,"images":1,"macros":1,"external_links":0,"defined_names":11,"comments":0,"pivot_tables":0},"unopened":[],"bounds":{"document_bytes":16777216,"sheet_cells":100000,"rows_first":2000,"rows_last":500,"rows_between":2000,"halvings":0,"cell_chars":16384,"cell_head_chars":4096},"cells_cut":0,"cells_raw":0,"read":"whole","date_system":"1900"}

{"sheet":"Instructions","index":0,"n_rows":33,"n_cols":12,"rows_kept":33,"cut":false,"hidden":false,"merged":[[30,1,30,5],[31,1,31,5],[32,1,32,5],[30,11,30,25],[31,11,31,25],[32,11,32,25],[8,8,8,13],[4,7,4,8],[6,5,6,10],[13,7,13,9],[29,1,29,5],[29,11,29,25],[28,11,28,25],[15,1,15,26],[16,1,16,26],[17,1,17,26],[23,1,23,25]]}
[]
[null,"ASG ADOPTER DATA COLLECTION TEMPLATE"]
[]
[]
[null,"Please indicate which quarter your new data relates to =>",null,null,null,null,null,"2025/26 Q4"]
[]
[null,"Please enter the name of your agency:"]
[]
[null,"Please enter the email address of the person completing this return:"]
[]
[null,"In order to use this tool you must enable macros in Excel"]
[]
[null,"PLEASE SUBMIT YOUR COMPLETED ADOPTER DATA RETURN TO :",null,null,null,null,null,null,"ASGLB@coram.org.uk"]
[]
[null,"INSTRUCTIONS FOR COMPLETING THE ADOPTER DATA RETURN"]
[null,{"$f":"\"1. The \"\"Data\"\" sheet is where you should paste (as values) the adopter-level data you are planning to submit for the period \"&TEXT(Data!$DN$1,\"d mmmm yyyy\")&\" to \"&TEXT(EDATE(Data!$DN$1,3*RIGHT(Instructions!H5,1))-1,\"d mmmm yyyy\")&\" - when you have added your data press the \"\"Check Data\"\" button in the top left corner of the \"\"Data\"\" Sheet\"","v":"1. The \"Data\" sheet is where you should paste (as values) the adopter-level data you are planning to submit for the period 1 April 2025 to 31 March 2026 - when you have added your data press the \"Check Data\" button in the top left corner of the \"Data\" Sheet"}]
[null,"2. A log of the queries raised can be found in the \"Queries\" sheet. This log will be freshly generated each time you go to the \"Queries\" sheet if any changes have been made to your data."]
[null,{"$f":"\"3. We have also included the \"\"Dashboard\"\" sheet to provide analysis of the data you enter into the \"\"Data\"\" sheet. If you only enter in data for cases active since \"&TEXT(Data!$DN$1,\"d mmmm yyyy\")&\" then the analysis shown for previous years will be incomplete. Please note that you can use\"","v":"3. We have also included the \"Dashboard\" sheet to provide analysis of the data you enter into the \"Data\" sheet. If you only enter in data for cases active since 1 April 2025 then the analysis shown for previous years will be incomplete. Please note that you can use"}]
[null,{"$f":"\"    the \"\"Dashboard\"\" sheet to analyse data from several years, as it has the capacity to look at data from across four financial years\"","v":"    the \"Dashboard\" sheet to analyse data from several years, as it has the capacity to look at data from across four financial years"}]
[]
[]
[null,"RECRUITMENT DATA"]
[]
[null,"Please complete the table below with your agency's recruitment data. Your marketing team / lead will be able to help provide this information."]
[]
[null,"This data is being collected on behalf of Adoption England, and will be used to inform adopter recruitment by monitoring the rates of enquiries and registrations of interest."]
[]
[]
[null,null,null,null,null,null,{"$f":"IF(H29<>\"\",Analysis!$G$2&\" Q1\",IF(ISERROR(FIND(\"Q1\",$H$5)),\"\",$H$5))","v":"2025/26 Q1"},{"$f":"IF(I29<>\"\",Analysis!$G$2&\" Q2\",IF(ISERROR(FIND(\"Q2\",$H$5)),\"\",$H$5))","v":"2025/26 Q2"},{"$f":"IF(J29<>\"\",Analysis!$G$2&\" Q3\",IF(ISERROR(FIND(\"Q3\",$H$5)),\"\",$H$5))","v":"2025/26 Q3"},{"$f":"IF(ISERROR(FIND(\"Q4\",$H$5)),\"\",$H$5)","v":"2025/26 Q4"},null,"Definitions for Recruitment Data:"]
[null,"Number of Website Sessions",null,null,null,null,null,null,null,null,null,"The total number of sessions to your website for each quarter, not number of users or new users"]
[null,"Number of Website Sessions from youcanadopt.co.uk ",null,null,null,null,null,null,null,null,null,"The total number of website sessions for each quarter from this referral source if known from your Google Analytics"]
[null,"Number of Initial Enquiries",null,null,null,null,null,null,null,null,null,"The total number of households who have enquired about adoption through your online enquiry form each quarter. Do not include enquiries through other channels such as over the phone or at events"]
[null,"Number of Registers of Interest",null,null,null,null,null,null,null,null,null,"The total number of households who complete a formal register of interest to begin the adoption process"]

{"sheet":"INSTRUCTIONS DATA EXPORT","index":1,"n_rows":2,"n_cols":17,"rows_kept":2,"cut":false,"hidden":true,"merged":[]}
["Agency code",{"$f":"\"Number of Website Sessions in \"&Instructions!G29","v":"Number of Website Sessions in 2025/26 Q1"},{"$f":"\"Number of Website Sessions in \"&Instructions!H29","v":"Number of Website Sessions in 2025/26 Q2"},{"$f":"\"Number of Website Sessions in \"&Instructions!I29","v":"Number of Website Sessions in 2025/26 Q3"},{"$f":"\"Number of Website Sessions in \"&Instructions!J29","v":"Number of Website Sessions in 2025/26 Q4"},{"$f":"\"'Number of Website Sessions from youcanadopt.co.uk  \"&Instructions!G29","v":"'Number of Website Sessions from youcanadopt.co.uk  2025/26 Q1"},{"$f":"\"'Number of Website Sessions from youcanadopt.co.uk  \"&Instructions!H29","v":"'Number of Website Sessions from youcanadopt.co.uk  2025/26 Q2"},{"$f":"\"'Number of Website Sessions from youcanadopt.co.uk  \"&Instructions!I29","v":"'Number of Website Sessions from youcanadopt.co.uk  2025/26 Q3"},{"$f":"\"'Number of Website Sessions from youcanadopt.co.uk  \"&Instructions!J29","v":"'Number of Website Sessions from youcanadopt.co.uk  2025/26 Q4"},{"$f":"\"Number of Initial Enquiries \"&Instructions!G2","v":"Number of Initial Enquiries "},{"$f":"\"Number of Initial Enquiries \"&Instructions!H29","v":"Number of Initial Enquiries 2025/26 Q2"},{"$f":"\"Number of Initial Enquiries \"&Instructions!I29","v":"Number of Initial Enquiries 2025/26 Q3"},{"$f":"\"Number of Initial Enquiries \"&Instructions!J29","v":"Number of Initial Enquiries 2025/26 Q4"},{"$f":"\"Number of Registers of Interest \"&Instructions!G29","v":"Number of Registers of Interest 2025/26 Q1"},{"$f":"\"Number of Registers of Interest \"&Instructions!H29","v":"Number of Registers of Interest 2025/26 Q2"},{"$f":"\"Number of Registers of Interest \"&Instructions!I29","v":"Number of Registers of Interest 2025/26 Q3"},{"$f":"\"Number of Registers of Interest \"&Instructions!J29","v":"Number of Registers of Interest 2025/26 Q4"}]
[{"$f":"Analysis!$B$3","v":{"$error":"#N/A"}},{"$f":"IF(Instructions!G30=\"\",\"\",Instructions!G30)","v":""},{"$f":"IF(Instructions!H30=\"\",\"\",Instructions!H30)","v":""},{"$f":"IF(Instructions!I30=\"\",\"\",Instructions!I30)","v":""},{"$f":"IF(Instructions!J30=\"\",\"\",Instructions!J30)","v":""},{"$f":"IF(Instructions!G31=\"\",\"\",Instructions!G31)","v":""},{"$f":"IF(Instructions!H31=\"\",\"\",Instructions!H31)","v":""},{"$f":"IF(Instructions!I31=\"\",\"\",Instructions!I31)","v":""},{"$f":"IF(Instructions!J31=\"\",\"\",Instructions!J31)","v":""},{"$f":"IF(Instructions!G32=\"\",\"\",Instructions!G32)","v":""},{"$f":"IF(Instructions!H32=\"\",\"\",Instructions!H32)","v":""},{"$f":"IF(Instructions!I32=\"\",\"\",Instructions!I32)","v":""},{"$f":"IF(Instructions!J32=\"\",\"\",Instructions!J32)","v":""},{"$f":"IF(Instructions!G33=\"\",\"\",Instructions!G33)","v":""},{"$f":"IF(Instructions!H33=\"\",\"\",Instructions!H33)","v":""},{"$f":"IF(Instructions!I33=\"\",\"\",Instructions!I33)","v":""},{"$f":"IF(Instructions!J33=\"\",\"\",Instructions!J33)","v":""}]

{"sheet":"Data","index":2,"n_rows":3,"n_cols":142,"rows_kept":3,"cut":false,"hidden":false,"merged":[]}
["A2","A3","A4","A5","A6","A7","A8","A9","A10","A11","A12","A13b","B1","B2","B3","B4","B5","B8","B9","B10","B11","C1","C2a","C2b","C3","C4","D1","D2",null,null,null,null,{"$f":"MATCH(LEFT(AG2,FIND(\" \",AG2)-1),$A$1:$AB$1,0)","v":2},{"$f":"MATCH(LEFT(AH2,FIND(\" \",AH2)-1),$A$1:$AB$1,0)","v":2},3,3,4,5,6,7,8,9,9,10,10,10,11,11,12,12,12,13,13,13,13,14,14,14,14,14,15,15,15,15,15,15,16,16,16,16,17,17,17,17,17,17,18,18,18,18,18,19,19,19,19,20,20,20,21,21,21,21,21,22,22,23,23,{"$f":"MATCH(LEFT(CT2,FIND(\" \",CT2)-1),$A$1:$AB$1,0)","v":23},23,24,24,25,25,25,25,26,26,26,26,26,27,28,28,28,28,null,null,{"$f":"IF(MONTH(DR1)<>3,DATE(YEAR(DR1),4,1),DATE(YEAR(DR1)-1,4,1))","v":"2025-04-01"},{"$f":"EDATE(DP1+1,-3)-1","v":"2025-06-30"},{"$f":"EDATE(DQ1+1,-3)-1","v":"2025-09-30"},{"$f":"EDATE(DR1+1,-3)-1","v":"2025-12-31"},{"$f":"RDate","v":"2026-03-31"},{"$f":"DO1","v":"2025-06-30"},{"$f":"DP1","v":"2025-09-30"},"2025-12-31",{"$f":"DR1","v":"2026-03-31"}]
["Individual adopter identifier","Application identifier","Gender","Date of birth","Religion","Sexual orientation","Ethnic origin","Is the (prospective) adopter classed as being disabled (0=No, 1=Yes)?","Relationship status","Is the (prospective) adopter the child(ren)’s foster carer\n(0=No, 1=Yes)?","Is the (prospective) adopter taking part in a FFA or CP arrangement\n(0=No, 1=Yes: child placed, 2=Yes: no child placed yet)?","URN of the child's LA","Date an enquiry was received","Date Stage 1 started","Date Stage 1 ended","Date Stage 2 started","Date Stage 2 ended","Date the (prospective) adopter(s) is matched with the child(ren)","Date the child(ren) is placed with the (prospective) adopter(s)","Number of children placed ","Date of AO","Has the (prospective) adopter previously adopted a child in England\n(0=No, 1=Yes)?","Date of leaving the adoption process","Reason for leaving the adoption process","Date of the disruption to the adoptive placement (prior to the AO)","Date the adoption process resumes","Is the (prospective) adopter being fast-tracked\n(0=No, 1=Yes)?","Family Finding code?","Comments to explain remaining queries","Disappeared?","Main applicant?","Active row?","A3 (i)","A3 (ii)","A4 (i)","A4 (ii)","A5 (i)","A6 (i)","A7 (i)","A8 (i)","A9 (i)","A10 (i)","A10 (ii)","A11 (i)","A11 (ii)","A11 (iii)","A12 (i)","A12 (ii)","A13b (i)","A13b (ii)","A13b (iii)","B1 (i)","B1 (ii)","B1 (iii)","B1 (iv)","B2 (i)","B2 (ii)","B2 (iii)","B2 (iv)","B2 (v)","B3 (i)","B3 (ii)","B3 (iii)","B3 (iv)","B3 (v)","B3 (vi)","B4 (i)","B4 (ii)","B4 (iii)","B4 (iv)","B5 (i)","B5 (ii)","B5 (iii)","B5 (iv)","B5 (v)","B5 (vi)","B8 (i)","B8 (ii)","B8 (iii)","B8 (iv)","B8 (v)","B9 (i)","B9 (ii)","B9 (iii)","B9 (iv)","B10 (i)","B10 (ii)","B10 (iii)","B11 (i)","B11 (ii)","B11 (iii)","B11 (iv)","B11 (v)","C1 (i)","C1 (ii)","C2a (i)","C2a (ii)","C2a (iii)","C2a (iv)","C2b (i)","C2b (ii)","C3 (i)","C3 (ii)","C3 (iii)","C3 (iv)","C4 (i)","C4 (ii)","C4 (iii)","C4 (iv)","C4 (v)","D1 (i)","D2 (i)","D2 (ii)","D2 (iii)","D2 (iiii)","Currently in S1","S2 pending","Currently in S2","Not yet approved (as at 9 months before the reporting date)","Not yet approved (as at 6 months before the reporting date)","Not yet approved (as at 3 months before the reporting date)","Not yet approved (as at the reporting date)","Waiting to be matched (as at 9 months before the reporting date)","Waiting to be matched (as at 6 months before the reporting date)","Waiting to be matched (as at 3 months before the reporting date)","Waiting to be matched (as at the reporting date)","Registration date","S1 completion time","S2 completion time","Approval time (m)","Match time (m)","Approved in reporting period within 6 months","Approved in reporting period after 6 months","Approved in reporting period no time","Matched in reporting period within 3 months","Matched in reporting period after 3 months","Matched in reporting period no time","S1 time to Rdate","S2 pending time to Rdate","S2 time to Rdate","Approved and waiting time to Rdate","Placed time to Rdate"]
[null,null,null,null,null,null,null,null,null,null,null,null,null,null,null,null,null,null,null,null,null,null,null,null,null,null,null,null,null,null,{"$f":"IF(COUNTIFS(B3:$B$9780,B3)=1,TRUE,FALSE)","v":false},{"$f":"IF(COUNTA($A3:$AB3)>0,TRUE,FALSE)","v":false},{"$f":"IF(OR(AND(COUNTIF(B$1:B$49780,B3)<>1,I3=\"SIN\"),AND(COUNTIF(B$1:B$49780,B3)<>2,I3<>\"NOBT\",I3<>\"OTH\",I3<>\"SIN\",I3<>\"REFU\")),\"The wrong number of adopters have been allocated this Application ID.\",\"\")","v":"The wrong number of adopters have been allocated this Application ID."},{"$f":"IF(B3=\"\",\"Application ID must be completed.\",\"\")","v":"Application ID must be completed."},{"$f":"IF(AND(C3<>\"\",OR(C3=0,C3=1,C3=2,C3=3,C3=4,C3=5,C3=6,C3=7,C3=8,C3=9)),\"\",\"Gender (A4) code must be entered and can only be 0, 1, 2,3,4,5,6,7,8 or 9\")","v":"Gender (A4) code must be entered and can only be 0, 1, 2,3,4,5,6,7,8 or 9"},{"$f":"IF(AND(COUNTIF(B$1:B$49780,B3)=2,AE3=TRUE),IF(AND(I3=\"SSP\",OR(AND(OR(C3=2,C3=5),OR(VLOOKUP(B3,B$1:AA$49780,AJ$1-1,FALSE)=1,VLOOKUP(B3,B$1:AA$49780,AJ$1-1,FALSE)=4)),AND(OR(C3=1,C3=4),OR(VLOOKUP(B3,B$1:AA$49780,AJ$1-1,FALSE)=2,VLOOKUP(B3,B$1:AA$49780,AJ$1-1,FALSE)=5)))),\"The same gender has to be entered for couples in a same-sex partnership (SSP)\",IF(AND(I3=\"CLM\",OR(AND(OR(C3=1,C3=4),OR(VLOOKUP(B3,B$1:AA$49780,AJ$1-1,FALSE)=1,VLOOKUP(B3,B$1:AA$49780,AJ$1-1,FALSE)=4)),AND(OR(C3=2,C3=5),OR(VLOOKUP(B3,B$1:AA$49780,AJ$1-1,FALSE)=2,VLOOKUP(B3,B$1:AA$49780,AJ$1-1,FALSE)=5)))),\"Different genders have to be entered for couples in a male/female partnership (CLM).\",\"\")),\"\")","v":""},{"$f":"IF(OR(D3=\"\",OR(ISNUMBER(D3)=FALSE,AND(ISNUMBER(D3)=TRUE,M3<>\"\",EDATE(D3,12*21)>M3))),\"Only suitable dates should be recorded here\",\"\")","v":"Only suitable dates should be recorded here"},{"$f":"IF(ISNA(MATCH(E3,Glossary!B$15:B$23,0)),\"Invalid code entered for Religion.\",\"\")","v":"Invalid code entered for Religion."},{"$f":"IF(ISNA(MATCH(F3,Lists!G$2:G$11,0)),\"Invalid code entered for Sexual orientation.\",\"\")","v":"Invalid code entered for Sexual orientation."},{"$f":"IF(ISNA(MATCH(G3,Lists!A$2:A$21,0)),\"Invalid code entered for Ethnicity.\",\"\")","v":"Invalid code entered for Ethnicity."},{"$f":"IF(AND(H3<>\"\",OR(H3=0,H3=1)),\"\",\"Disability (A9) code can only be 0 or 1\")","v":"Disability (A9) code can only be 0 or 1"},{"$f":"IF(ISNA(MATCH(I3,Lists!J$2:J$9,0)),\"Invalid code entered for Relationship status.\",\"\")","v":"Invalid code entered for Relationship status."},{"$f":"IF(AND(COUNTIF(B$1:B$49780,B3)=2,AE3=TRUE),IF(I3<>VLOOKUP(B3,B$1:AA$49780,AQ$1-1,FALSE),\"The relationship status should be the same for both adults under this application.\",\"\"),\"\")","v":""},{"$f":"IF(OR(J3=0,J3=1),\"\",\"A11 code can only be 0 (No) or 1 (Yes).\")","v":""},{"$f":"IF(AND(COUNTIF(B$1:B$49780,B3)=2,AE3=TRUE),IF(J3<>VLOOKUP(B3,B$1:AA$49780,AS$1-1,FALSE),\"The foster carer flag should be the same for both adults under this application.\",\"\"),\"\")","v":""},{"$f":"IF(AND(J3=1,K3=1),\"A carer should only be flagged as EITHER a foster carer or FFA carer, and not both\",\"\")","v":""},{"$f":"IF(OR(K3=0,K3=1,K3=2),\"\",\"A12 code can only be 0 (No), 1 (Yes: Child placed) or 2 (Yes: No child placed yet).\")","v":""},{"$f":"IF(AND(COUNTIF(B$1:B$49780,B3)=2,AE3=TRUE),IF(K3<>VLOOKUP(B3,B$1:AA$49780,AV$1-1,FALSE),\"The FFA flag should be the same for both adults under this application.\",\"\"),\"\")","v":""},{"$f":"IF(ISNUMBER(L3),IF(AND(ISNA(MATCH(L3*1,URN!$A$2:$A$500,0)),ISNA(MATCH(L3*1,URN!$B$2:$B$500,0)),L3<>\"\"),\"Unrecognised URN entered for A13b.\",\"\"),IF(AND(ISNA(MATCH(L3,URN!$A$2:$A$500,0)),ISNA(MATCH(L3,URN!$B$2:$B$500,0)),L3<>\"\"),\"Unrecognised URN entered for A13b.\",\"\"))","v":""},{"$f":"IF(AND(OR(S3<>\"\",U3<>\"\"),L3=\"\"),\"The URN for the child's LA is missing.\",\"\")","v":""},{"$f":"IF(AND(COUNTIF(B$1:B$49780,B3)=2,AE3=TRUE),IF(L3<>VLOOKUP(B3,B$1:AA$49780,AY$1-1,FALSE),\"The URN code should be the same for both adults under this application.\",\"\"),\"\")","v":""},{"$f":"IF(M3=\"\",\"Enquiry date (B1) must be completed.\",\"\")","v":"Enquiry date (B1) must be completed."},{"$f":"IF(AND(COUNTIF(B$1:B$49780,B3)=2,AE3=TRUE),IF(M3<>VLOOKUP(B3,B$1:AA$49780,BA$1-1,FALSE),\"The enquiry date should be the same for both adults under this application.\",\"\"),\"\")","v":""},{"$f":"IF(AND(M3<>\"\",OR(ISNUMBER(M3)=FALSE,AND(ISNUMBER(M3)=TRUE,OR(M3>RDate,M3<D3)))),\"Only suitable dates should be recorded here\",\"\")","v":""},{"$f":"IF(COUNTBLANK(N3:U3)=8,\"Has this adopter only made an enquiry to adopt? If so, then please delete this record as we only collect data on adopters who have made a successful application.\",\"\")","v":"Has this adopter only made an enquiry to adopt? If so, then please delete this record as we only collect data on adopters who have made a successful application."},{"$f":"IF(AND(N3=\"\",AA3<>1),\"Stage 1 start date (B2) must be completed if case is not fast-tracked.\",\"\")","v":"Stage 1 start date (B2) must be completed if case is not fast-tracked."},{"$f":"IF(AND(OR(O3<>\"\",N3<>\"\"),AA3=1),\"Please do not record any dates under B2 if case was fast-tracked.\",\"\")","v":""},{"$f":"IF(AND(M3<>\"\",N3<>\"\",M3>N3),\"Stage 1 start date cannot be before the enquiry date (B1).\",\"\")","v":""},{"$f":"IF(AND(COUNTIF(B$1:B$49780,B3)=2,AE3=TRUE),IF(N3<>VLOOKUP(B3,B$1:AA$49780,BG$1-1,FALSE),\"The Stage 1 start date should be the same for both adults under this application.\",\"\"),\"\")","v":""},{"$f":"IF(AND(N3<>\"\",OR(ISNUMBER(N3)=FALSE,AND(ISNUMBER(N3)=TRUE,OR(N3>RDate,N3<M3)))),\"Only suitable dates should be recorded here\",\"\")","v":""},{"$f":"IF(AND(N3<>\"\",O3<>\"\",N3>O3),\"Stage 1 end date must be after Stage 1 start date (B2).\",\"\")","v":""},{"$f":"IF(AND(OR(N3<>\"\",AND(N3=\"\",AA3<>1)),O3=\"\",OR(P3<>\"\",Q3<>\"\",R3<>\"\",S3<>\"\",U3<>\"\")),\"Stage 1 end date is missing.\",\"\")","v":""},{"$f":"IF(AND(OR(O3<>\"\",N3<>\"\"),AA3=1),\"Please do not record any dates under B3 if case was fast-tracked.\",\"\")","v":""},{"$f":"IF(AND(N3<>\"\",O3<>\"\",O3-N3<14),\"The data indicates Stage 1 lasted less than a fortnight. Is this correct? If not please enter correct dates\",\"\")","v":""},{"$f":"IF(AND(COUNTIF(B$1:B$49780,B3)=2,AE3=TRUE),IF(O3<>VLOOKUP(B3,B$1:AA$49780,BM$1-1,FALSE),\"The Stage 1 end date should be the same for both adults under this application.\",\"\"),\"\")","v":""},{"$f":"IF(AND(O3<>\"\",OR(ISNUMBER(O3)=FALSE,AND(ISNUMBER(O3)=TRUE,OR(O3>RDate,O3<N3)))),\"Only suitable dates should be recorded here\",\"\")","v":""},{"$f":"IF(AND(P3=\"\",OR(Q3<>\"\",AND(OR(N3<>\"\",O3<>\"\"),OR(R3<>\"\",S3<>\"\",U3<>\"\")))),\"Stage 2 start date is missing.\",\"\")","v":""},{"$f":"IF(AND(P3<>\"\",Q3<>\"\",P3>Q3),\"Stage 2 start date must be before Stage 2 end date (B5).\",\"\")","v":""},{"$f":"IF(AND(COUNTIF(B$1:B$49780,B3)=2,AE3=TRUE),IF(P3<>VLOOKUP(B3,B$1:AA$49780,BQ$1-1,FALSE),\"The Stage 2 start date should be the same for both adults under this application.\",\"\"),\"\")","v":""},{"$f":"IF(AND(P3<>\"\",OR(ISNUMBER(P3)=FALSE,AND(ISNUMBER(P3)=TRUE,OR(P3>RDate,P3<M3)))),\"Only suitable dates should be recorded here\",\"\")","v":""},{"$f":"IF(AND(Q3=\"\",AND(OR(N3<>\"\",O3<>\"\",P3<>\"\"),OR(R3<>\"\",S3<>\"\",U3<>\"\"))),\"Stage 2 end date is missing.\",\"\")","v":""},{"$f":"IF(AND(Q3<>\"\",R3<>\"\",Q3>R3),\"Stage 2 end date cannot be after match date (B8).\",\"\")","v":""},{"$f":"IF(AND(P3<>\"\",Q3<>\"\",Q3-P3<30),\"The data indicates Stage 2 lasted less than a month. Is this correct? If not please enter the correct dates\",\"\")","v":""},{"$f":"IF(AND(COUNTIF(B$1:B$49780,B3)=2,AE3=TRUE),IF(Q3<>VLOOKUP(B3,B$1:AA$49780,BV$1-1,FALSE),\"The Stage 2 end date should be the same for both adults under this application.\",\"\"),\"\")","v":""},{"$f":"IF(AND(Q3<>\"\",OR(ISNUMBER(Q3)=FALSE,AND(ISNUMBER(Q3)=TRUE,OR(Q3>RDate,Q3<P3)))),\"Only suitable dates should be recorded here\",\"\")","v":""},{"$f":"IF(AND(Q3<>\"\",R3=\"\",S3=\"\",W3=\"\",U3=\"\",EDATE(Q3,12)<=RDate,K3<>1),\"This adopter has not had a match, placement or withdrawal within 1 year of their approval, please check that this adopter's record is up-to-date\",\"\")","v":""},{"$f":"IF(AND(R3<>\"\",S3<>\"\",R3>S3),\"Match date cannot be after placement date (B9).\",\"\")","v":""},{"$f":"IF(AND(R3=\"\",OR(S3<>\"\",U3<>\"\")),\"Match date is missing.\",\"\")","v":""},{"$f":"IF(AND(OR(J3=1,K3=1),R3<>\"\",S3<>\"\",R3<>S3),\"If children are adopted by their FFA/foster carer the date of placement (B9) should be the same as the date the adoptive match was approved.\",\"\")","v":""},{"$f":"IF(AND(COUNTIF(B$1:B$49780,B3)=2,AE3=TRUE),IF(R3<>VLOOKUP(B3,B$1:AA$49780,CB$1-1,FALSE),\"The match date should be the same for both adults under this application.\",\"\"),\"\")","v":""},{"$f":"IF(AND(R3<>\"\",OR(ISNUMBER(R3)=FALSE,AND(ISNUMBER(R3)=TRUE,OR(R3>RDate,R3<Q3)))),\"Only suitable dates should be recorded here\",\"\")","v":""},{"$f":"IF(AND(S3<>\"\",U3<>\"\",S3>U3),\"Placement date cannot be after AO date (B11).\",\"\")","v":""},{"$f":"IF(AND(S3=\"\",OR(U3<>\"\",Y3<>\"\",T3>0)),\"Placement date is missing.\",\"\")","v":""},{"$f":"IF(AND(COUNTIF(B$1:B$49780,B3)=2,AE3=TRUE),IF(S3<>VLOOKUP(B3,B$1:AA$49780,CF$1-1,FALSE),\"The placement date should be the same for both adults under this application.\",\"\"),\"\")","v":""},{"$f":"IF(AND(S3<>\"\",OR(ISNUMBER(S3)=FALSE,AND(ISNUMBER(S3)=TRUE,OR(S3>RDate,S3<R3)))),\"Only suitable dates should be recorded here\",\"\")","v":""},{"$f":"IF(AND(S3<>\"\",T3<=0),\"Value under B10 is missing.\",\"\")","v":""},{"$f":"IF(AND(COUNTIF(B$1:B$49780,B3)=2,AE3=TRUE),IF(T3<>VLOOKUP(B3,B$1:AA$49780,CI$1-1,FALSE),\"The number of children placed should be the same for both adults under this application.\",\"\"),\"\")","v":""},{"$f":"IF(AND(S3=\"\",T3<>\"\"),\"B10 should be blank if no children are placed with this adopter.\",\"\")","v":""},{"$f":"IF(AND(S3<>\"\",OR(Y3=\"\",S3>Y3),AC3=TRUE,U3=\"\"),\"AO date appears to be missing.\",\"\")","v":""},{"$f":"IF(AND(J3<>1,K3<>1,S3<>\"\",U3<>\"\",U3-S3<70),\"The child does not appear to have been adopted by a FFA/foster carer so we would not expect the AO to be granted less than 10 weeks after placement.\",\"\")","v":""},{"$f":"IF(AND(COUNTIF(B$1:B$49780,B3)=2,AE3=TRUE),IF(U3<>VLOOKUP(B3,B$1:AA$49780,CM$1-1,FALSE),\"The date of Adoption Order should be the same for both adults under this application.\",\"\"),\"\")","v":""},{"$f":"IF(AND(U3<>\"\",OR(ISNUMBER(U3)=FALSE,AND(ISNUMBER(U3)=TRUE,OR(U3>RDate,U3<S3)))),\"Only suitable dates should be recorded here\",\"\")","v":""},{"$f":"IF(AND(U3<>\"\",OR(X3=1,X3=3)),\"Either the adopter has adopted (keep B11; clear C2a & C2b) or the adopter has left the adoption process by withdrawing / refusal of application (keep C2a & C2b; clear B11)\",\"\")","v":""},{"$f":"IF(OR(V3=0,V3=1),\"\",\"C1 entry is invalid - must be 0 (No) or 1 (Yes).\")","v":""},{"$f":"IF(AND(COUNTIF(B$1:B$49780,B3)=2,AE3=TRUE),IF(V3<>VLOOKUP(B3,B$1:AA$49780,CQ$1-1,FALSE),\"The previously adopted flag should be the same for both adults under this application.\",\"\"),\"\")","v":""},{"$f":"IF(AND(W3=\"\",OR(AC3=TRUE,X3<>\"\",Z3<>\"\")),\"C2a date appears to be missing.\",\"\")","v":""},{"$f":"IF(AND(W3<>\"\",X3<>2,W3<MIN(M3:V3)),\"C2a date cannot be before any other dates in this journey.\",\"\")","v":""},{"$f":"IF(AND(COUNTIF(B$1:B$49780,B3)=2,AE3=TRUE),IF(W3<>VLOOKUP(B3,B$1:AA$49780,CT$1-1,FALSE),\"The C2a date should be the same for both adults under this application.\",\"\"),\"\")","v":""},{"$f":"IF(AND(W3<>\"\",OR(ISNUMBER(W3)=FALSE,AND(ISNUMBER(W3)=TRUE,OR(W3>RDate,W3<M3)))),\"Only suitable dates should be recorded here\",\"\")","v":""},{"$f":"IF(AND(X3=\"\",OR(AC3=TRUE,W3<>\"\",Z3<>\"\")),\"C2b code appears to be missing.\",\"\")","v":""},{"$f":"IF(AND(COUNTIF(B$1:B$49780,B3)=2,AE3=TRUE),IF(X3<>VLOOKUP(B3,B$1:AA$49780,CW$1-1,FALSE),\"The reason code should be the same for both adults under this application.\",\"\"),\"\")","v":""},{"$f":"IF(AND(Y3<>\"\",S3<>\"\",S3>Y3),\"Disruption date must be after placement date (B9).\",\"\")","v":""},{"$f":"IF(AND(S3<>\"\",U3=\"\",W3<>\"\",Y3=\"\",X3<>2),\"Disruption date appears to be missing.\",\"\")","v":""},{"$f":"IF(AND(COUNTIF(B$1:B$49780,B3)=2,AE3=TRUE),IF(Y3<>VLOOKUP(B3,B$1:AA$49780,CZ$1-1,FALSE),\"The disruption date should be the same for both adults under this application.\",\"\"),\"\")","v":""},{"$f":"IF(AND(Y3<>\"\",OR(ISNUMBER(Y3)=FALSE,AND(ISNUMBER(Y3)=TRUE,OR(Y3>RDate,Y3<S3)))),\"Only suitable dates should be recorded here\",\"\")","v":""},{"$f":"IF(AND(Z3<>\"\",W3<>\"\",X3=2,W3>Z3),\"Process restart must be after C2a.\",\"\")","v":""},{"$f":"IF(AND(X3=2,W3<MAX(M3:U3),Z3=\"\"),\"Process restart date is missing.\",\"\")","v":""},{"$f":"IF(AND(COUNTIF(B$1:B$49780,B3)=2,AE3=TRUE),IF(Z3<>VLOOKUP(B3,B$1:AA$49780,DD$1-1,FALSE),\"The restart date should be the same for both adults under this application.\",\"\"),\"\")","v":""},{"$f":"IF(AND(Z3<>\"\",OR(ISNUMBER(Z3)=FALSE,AND(ISNUMBER(Z3)=TRUE,OR(Z3>RDate,Z3<X3)))),\"Only suitable dates should be recorded here\",\"\")","v":""},{"$f":"IF(AND(Z3<>\"\",X3<>2),\"C4 should only be populated if there is a 2 recorded under C2b.\",\"\")","v":""},{"$f":"IF(OR(AA3=0,AA3=1),\"\",\"Fast track (D1) code can only be 0 or 1\")","v":""},{"$f":"IF(AND(DV3=TRUE,OR(AB3=\"\",ISNUMBER(AB3)=FALSE,AB3<1,AB3>4)),\"Please provide an appropriate Family finding code (D2) for this adopter\",\"\")","v":""},{"$f":"IF(AND(COUNTIF(B$1:B$49780,B3)=2,AE3=TRUE),IF(AB3<>VLOOKUP(B3,B$1:AB$49780,DI$1-1,FALSE),\"The family finding code should be the same for both adults under this application.\",\"\"),\"\")","v":""},{"$f":"IF(AND(R3<>\"\",S3=\"\",U3=\"\",AB3<>4),\"Family finding code (D2) should be '4' since adopters are matched with a child\",\"\")","v":""},{"$f":"IF(AND(OR(J3=1,K3=1),DV3=TRUE,AB3<>3),\"Family finding code (D2) should be '3' since adopters are linked with a specific child\",\"\")","v":""},{"$f":"AND($N3<>\"\",COUNTA($O3:$S3,$U3,$Y3)=0,OR($W3=\"\",AND($W3<>\"\",$X3=2)))","v":false},{"$f":"AND($O3<>\"\",COUNTA($P3:$S3,$U3,$Y3)=0,OR($W3=\"\",AND($W3<>\"\",$X3=2)))","v":false},{"$f":"AND($P3<>\"\",COUNTA($Q3:$S3,$U3,$Y3)=0,OR($W3=\"\",AND($W3<>\"\",$X3=2)))","v":false},{"$f":"AND($Q3<>\"\",$Q3<=DS$1,NOT(AND($U3<>\"\",$U3<=DS$1)),NOT(AND($W3<>\"\",$W3<=DS$1,OR($X3=1,$X3=3))),OR($R3=\"\",$R3>DS$1,AND($R3<>\"\",$Y3<>\"\",$Y3>=$R3,$Y3<=DS$1)),OR($S3=\"\",$S3>DS$1,AND($S3<>\"\",$Y3<>\"\",$Y3>=$S3,$Y3<=DS$1)))","v":false},{"$f":"AND($Q3<>\"\",$Q3<=DT$1,NOT(AND($U3<>\"\",$U3<=DT$1)),NOT(AND($W3<>\"\",$W3<=DT$1,OR($X3=1,$X3=3))),OR($R3=\"\",$R3>DT$1,AND($R3<>\"\",$Y3<>\"\",$Y3>=$R3,$Y3<=DT$1)),OR($S3=\"\",$S3>DT$1,AND($S3<>\"\",$Y3<>\"\",$Y3>=$S3,$Y3<=DT$1)))","v":false},{"$f":"AND($Q3<>\"\",$Q3<=DU$1,NOT(AND($U3<>\"\",$U3<=DU$1)),NOT(AND($W3<>\"\",$W3<=DU$1,OR($X3=1,$X3=3))),OR($R3=\"\",$R3>DU$1,AND($R3<>\"\",$Y3<>\"\",$Y3>=$R3,$Y3<=DU$1)),OR($S3=\"\",$S3>DU$1,AND($S3<>\"\",$Y3<>\"\",$Y3>=$S3,$Y3<=DU$1)))","v":false},{"$f":"AND($Q3<>\"\",$Q3<=DV$1,NOT(AND($U3<>\"\",$U3<=DV$1)),NOT(AND($W3<>\"\",$W3<=DV$1,OR($X3=1,$X3=3))),OR($R3=\"\",$R3>DV$1,AND($R3<>\"\",$Y3<>\"\",$Y3>=$R3,$Y3<=DV$1)),OR($S3=\"\",$S3>DV$1,AND($S3<>\"\",$Y3<>\"\",$Y3>=$S3,$Y3<=DV$1)))","v":false},{"$f":"AND($Q3<>\"\",OR(R3=\"\",R3>DS$1),OR(T3=\"\",T3>DS$1,U3=2,U3=\"\"),$Q3<=DS$1,OR(AND($R3=\"\",OR($W3=\"\",$W3>DS$1,$X3=2),OR($S3=\"\",$S3>DS$1)),$R3>DS$1,AND($S3<>\"\",$Y3<>\"\",$S3<$Y3,$Y3<DS$1)))","v":false},{"$f":"AND($Q3<>\"\",OR(S3=\"\",S3>DT$1),OR(U3=\"\",U3>DT$1,V3=2,V3=\"\"),$Q3<=DT$1,OR(AND($R3=\"\",OR($W3=\"\",$W3>DT$1,$X3=2),OR($S3=\"\",$S3>DT$1)),$R3>DT$1,AND($S3<>\"\",$Y3<>\"\",$S3<$Y3,$Y3<DT$1)))","v":false},{"$f":"AND($Q3<>\"\",OR(S3=\"\",S3>DU$1),OR(U3=\"\",U3>DU$1,V3=2,V3=\"\"),$Q3<=DU$1,OR(AND($R3=\"\",OR($W3=\"\",$W3>DU$1,$X3=2),OR($S3=\"\",$S3>DU$1)),$R3>DU$1,AND($S3<>\"\",$Y3<>\"\",$S3<$Y3,$Y3<DU$1)))","v":false},{"$f":"AND($Q3<>\"\",OR(U3=\"\",U3>DV$1),OR(W3=\"\",W3>DV$1,X3=2,X3=\"\"),$Q3<=DV$1,OR(AND($R3=\"\",OR($W3=\"\",$W3>DV$1,$X3=2),OR($S3=\"\",$S3>DV$1)),$R3>DV$1,AND($S3<>\"\",$Y3<>\"\",$S3<$Y3,$Y3<DV$1)))","v":false},{"$f":"IF($N3<>\"\",$N3,IF($P3<>\"\",$P3,\"\"))","v":""},{"$f":"IF(AND($N3<>\"\",$O3<>\"\",$N3<$O3),DATEDIF($N3,$O3,\"m\"),\"\")","v":""},{"$f":"IF(AND($P3<>\"\",$Q3<>\"\",$P3<$Q3),DATEDIF($P3,$Q3,\"m\"),\"\")","v":""},{"$f":"IF(AND($N3<>\"\",$Q3<>\"\",$N3<$Q3),DATEDIF($N3,$Q3,\"m\"),IF(AND($N3=\"\",$P3<>\"\",$Q3<>\"\",$P3<$Q3),DATEDIF($P3,$Q3,\"m\"),\"\"))","v":""},{"$f":"IF(AND($Q3<>\"\",$R3<>\"\",$Q3<=$R3),DATEDIF($Q3,$R3,\"m\"),\"\")","v":""},{"$f":"AND($Q3<>\"\",$Q3>=$DN$1,$Q3<=RDate,$DZ3<6)","v":false},{"$f":"AND($Q3<>\"\",$Q3>=$DN$1,$Q3<=RDate,$DZ3>=6)","v":false},{"$f":"AND($Q3<>\"\",$Q3>=$DN$1,$Q3<=RDate,$EB3=FALSE,$EC3=FALSE)","v":false},{"$f":"AND($R3<>\"\",$R3>=$DN$1,$R3<=RDate,$EA3<3)","v":false},{"$f":"AND($R3<>\"\",$R3>=$DN$1,$R3<=RDate,$EA3>=3)","v":false},{"$f":"AND($R3<>\"\",$R3>=$DN$1,$R3<=RDate,$EE3=FALSE,$EF3=FALSE)","v":false},{"$f":"IF(AND($N3<=RDate,$DL3=TRUE),DATEDIF($N3,RDate,\"m\"),\"\")","v":""},{"$f":"IF(AND($O3<=RDate,$DM3=TRUE),DATEDIF($O3,RDate,\"m\"),\"\")","v":""},{"$f":"IF(AND($P3<=RDate,$DN3=TRUE),DATEDIF($P3,RDate,\"m\"),\"\")","v":""},{"$f":"IF(AND($Q3<=RDate,$DV3=TRUE),DATEDIF($Q3,RDate,\"m\"),\"\")","v":""},{"$f":"IF(AND($S3<RDate,$S3<>\"\",$U3=\"\",OR($Y3=\"\",AND($Y3<>\"\",$S3>$Y3))),DATEDIF($S3,RDate,\"m\"),\"\")","v":""}]

{"sheet":"Dashboard","index":3,"n_rows":68,"n_cols":31,"rows_kept":68,"cut":false,"hidden":false,"merged":[[33,1,34,4],[48,1,49,4],[61,1,62,4],[58,1,58,9],[56,1,56,4],[56,11,56,23],[56,25,56,29],[57,1,57,4],[57,6,57,9],[45,26,45,28],[57,26,57,28],[58,26,58,28],[30,26,30,28],[63,17,63,28],[29,1,29,4],[29,6,29,9],[50,17,50,28],[44,1,44,4],[44,6,44,9],[45,1,45,9],[30,1,30,9],[43,1,43,4],[43,6,43,9],[43,11,43,23],[43,25,43,29],[35,17,35,28],[29,26,29,28],[42,0,67,0],[2,5,3,5],[2,6,3,6],[14,0,39,0],[2,0,13,0],[15,1,15,4],[15,6,15,9],[2,7,3,7],[2,4,3,4],[16,6,16,9],[22,2,22,14],[28,1,28,4],[63,2,63,14],[35,2,35,14],[40,0,40,29],[50,2,50,14],[0,0,0,29],[5,21,5,24],[15,11,15,23],[22,17,22,28],[28,25,28,29],[17,1,17,9],[3,20,3,24],[28,6,28,9],[28,11,28,23],[20,1,21,4],[4,21,4,23]]}
[{"$f":"Analysis!$C$1&\" - Adopters Journey Dashboard as at \"&TEXT(RDate,\"d mmmm yyyy\")&\" (page 1 of 2)\"","v":"0 - Adopters Journey Dashboard as at 31 March 2026 (page 1 of 2)"}]
[]
["Summary of analysis to be published",null,null,null,{"$f":"INDEX(Lists!$S$2:$S$49,MATCH(F3,Lists!$S$2:$S$49,0)-1)","v":"2025/26 Q1"},{"$f":"INDEX(Lists!$S$2:$S$49,MATCH(G3,Lists!$S$2:$S$49,0)-1)","v":"2025/26 Q2"},{"$f":"INDEX(Lists!$S$2:$S$49,MATCH(H3,Lists!$S$2:$S$49,0)-1)","v":"2025/26 Q3"},{"$f":"VLOOKUP(RDate,Lists!$R$2:$S$49,2,FALSE)","v":"2025/26 Q4"},"Total"]
[null,"Number of households…*",null,null,null,null,null,null,{"$f":"LEFT(H3,7)&IF(RIGHT(H3,2)=\"Q4\",\"\",\"*\")","v":"2025/26"},null,"Number of households…",null,null,null,null,null,null,null,null,null,{"$f":"IF(Z12=1,\"1 household approved and waiting\",Z12&\" households approved and waiting\")","v":"0 households approved and waiting"}]
[null,null,null,"granted AOs",{"$f":"HLOOKUP(E$3,Analysis!$B$19:$AG$27,2,FALSE)","v":0},{"$f":"HLOOKUP(F$3,Analysis!$B$19:$AG$27,2,FALSE)","v":0},{"$f":"HLOOKUP(G$3,Analysis!$B$19:$AG$27,2,FALSE)","v":0},{"$f":"HLOOKUP(H$3,Analysis!$B$19:$AG$27,2,FALSE)","v":0},{"$f":"HLOOKUP(I$4,Analysis!$B$33:$I$41,2,FALSE)","v":0},null,null,null,null,null,null,null,null,null,{"$f":"\"whose approval was made in \"&$I$4&\", who were approved within 6 months of application \"","v":"whose approval was made in 2025/26, who were approved within 6 months of application "},{"$f":"COUNTIFS(Data!$EB$3:$EB$99780,TRUE,Data!$AE$3:$AE$99780,TRUE)","v":0},null,{"$f":"\"including \"&IF(Analysis!$N$72<>1,Analysis!$N$72&\" cases on hold\",Analysis!$N$72&\" case on hold\")","v":"including 0 cases on hold"}]
[null,null,null,"having children move in",{"$f":"HLOOKUP(E$3,Analysis!$B$19:$AG$27,3,FALSE)","v":0},{"$f":"HLOOKUP(F$3,Analysis!$B$19:$AG$27,3,FALSE)","v":0},{"$f":"HLOOKUP(G$3,Analysis!$B$19:$AG$27,3,FALSE)","v":0},{"$f":"HLOOKUP(H$3,Analysis!$B$19:$AG$27,3,FALSE)","v":0},{"$f":"HLOOKUP(I$4,Analysis!$B$33:$I$41,3,FALSE)","v":0},null,null,null,null,null,null,null,null,null,{"$f":"\"whose approval was made in \"&$I$4&\", who were approved at least 6 months from application \"","v":"whose approval was made in 2025/26, who were approved at least 6 months from application "},{"$f":"COUNTIFS(Data!$EC$3:$EC$99780,TRUE,Data!$AE$3:$AE$99780,TRUE)","v":0},null,"Time since approval"]
[null,null,null,"matched with children",{"$f":"HLOOKUP(E$3,Analysis!$B$19:$AG$27,4,FALSE)","v":0},{"$f":"HLOOKUP(F$3,Analysis!$B$19:$AG$27,4,FALSE)","v":0},{"$f":"HLOOKUP(G$3,Analysis!$B$19:$AG$27,4,FALSE)","v":0},{"$f":"HLOOKUP(H$3,Analysis!$B$19:$AG$27,4,FALSE)","v":0},{"$f":"HLOOKUP(I$4,Analysis!$B$33:$I$41,4,FALSE)","v":0},null,null,null,null,null,null,null,null,null,{"$f":"\"whose approval was made in \"&$I$4&\", where no approval timescale is available \"","v":"whose approval was made in 2025/26, where no approval timescale is available "},{"$f":"COUNTIFS(Data!$ED$3:$ED$99780,TRUE,Data!$AE$3:$AE$99780,TRUE)","v":0}]
[null,null,null,"withdrawing after approval",{"$f":"HLOOKUP(E$3,Analysis!$B$19:$AG$27,9,FALSE)","v":0},{"$f":"HLOOKUP(F$3,Analysis!$B$19:$AG$27,9,FALSE)","v":0},{"$f":"HLOOKUP(G$3,Analysis!$B$19:$AG$27,9,FALSE)","v":0},{"$f":"HLOOKUP(H$3,Analysis!$B$19:$AG$27,9,FALSE)","v":0},{"$f":"HLOOKUP(I$4,Analysis!$B$33:$I$41,9,FALSE)","v":0},null,null,null,null,null,null,null,null,null,{"$f":"\"whose adoptive match was made in \"&$I$4&\", who were matched within 3 months of being approved \"","v":"whose adoptive match was made in 2025/26, who were matched within 3 months of being approved "},{"$f":"COUNTIFS(Data!$EE$3:$EE$99780,TRUE,Data!$AE$3:$AE$99780,TRUE)","v":0}]
[null,null,null,"approved",{"$f":"HLOOKUP(E$3,Analysis!$B$19:$AG$27,5,FALSE)","v":0},{"$f":"HLOOKUP(F$3,Analysis!$B$19:$AG$27,5,FALSE)","v":0},{"$f":"HLOOKUP(G$3,Analysis!$B$19:$AG$27,5,FALSE)","v":0},{"$f":"HLOOKUP(H$3,Analysis!$B$19:$AG$27,5,FALSE)","v":0},{"$f":"HLOOKUP(I$4,Analysis!$B$33:$I$41,5,FALSE)","v":0},null,null,null,null,null,null,null,null,null,{"$f":"\"whose adoptive match was made in \"&$I$4&\", who were matched at least 3 months after being approved \"","v":"whose adoptive match was made in 2025/26, who were matched at least 3 months after being approved "},{"$f":"COUNTIFS(Data!$EF$3:$EF$99780,TRUE,Data!$AE$3:$AE$99780,TRUE)","v":0}]
[null,null,null,"starting Stage 1",{"$f":"HLOOKUP(E$3,Analysis!$B$19:$AG$27,8,FALSE)","v":0},{"$f":"HLOOKUP(F$3,Analysis!$B$19:$AG$27,8,FALSE)","v":0},{"$f":"HLOOKUP(G$3,Analysis!$B$19:$AG$27,8,FALSE)","v":0},{"$f":"HLOOKUP(H$3,Analysis!$B$19:$AG$27,8,FALSE)","v":0},{"$f":"HLOOKUP(I$4,Analysis!$B$33:$I$41,8,FALSE)","v":0},null,null,null,null,null,null,null,null,null,{"$f":"\"whose adoptive match was made in \"&$I$4&\", where no match timescale is available \"","v":"whose adoptive match was made in 2025/26, where no match timescale is available "},{"$f":"COUNTIFS(Data!$EG$3:$EG$99780,TRUE,Data!$AE$3:$AE$99780,TRUE)","v":0}]
[]
[null,null,null,"waiting to be matched",{"$f":"COUNTIFS(Data!DS$3:DS$99780,TRUE,Data!$AE$3:$AE$99780,TRUE)","v":0},{"$f":"COUNTIFS(Data!DT$3:DT$99780,TRUE,Data!$AE$3:$AE$99780,TRUE)","v":0},{"$f":"COUNTIFS(Data!DU$3:DU$99780,TRUE,Data!$AE$3:$AE$99780,TRUE)","v":0},{"$f":"COUNTIFS(Data!DV$3:DV$99780,TRUE,Data!$AE$3:$AE$99780,TRUE)","v":0},null,null,null,null,null,null,null,null,null,null,{"$f":"\"Percentage of households matched in \"&$I$4&\", who were matched more than 3 months after being approved \"","v":"Percentage of households matched in 2025/26, who were matched more than 3 months after being approved "},{"$f":"IFERROR(T9/I7,\"\")","v":""},{"$f":"U13&\" - \"&Analysis!M71","v":"0 - Under 3 months"},{"$f":"V13&\" - \"&Analysis!M70","v":"0 - 3-6 months"},{"$f":"W13&\" - \"&Analysis!M69","v":"0 - 6-9 months"},{"$f":"X13&\" - \"&Analysis!M68","v":"0 - 9-12 months"},{"$f":"Y13&\" - \"&Analysis!M67","v":"0 - Over 1 year"},{"$f":"SUM(U13:Y13)","v":0}]
[null,null,null,"not yet approved",{"$f":"COUNTIFS(Data!DO$3:DO$99780,TRUE,Data!$AE$3:$AE$99780,TRUE)","v":0},{"$f":"COUNTIFS(Data!DP$3:DP$99780,TRUE,Data!$AE$3:$AE$99780,TRUE)","v":0},{"$f":"COUNTIFS(Data!DQ$3:DQ$99780,TRUE,Data!$AE$3:$AE$99780,TRUE)","v":0},{"$f":"COUNTIFS(Data!DR$3:DR$99780,TRUE,Data!$AE$3:$AE$99780,TRUE)","v":0},null,null,null,null,null,null,null,null,null,null,null,null,{"$f":"Analysis!N71","v":0},{"$f":"Analysis!N70","v":0},{"$f":"Analysis!N69","v":0},{"$f":"Analysis!N68","v":0},{"$f":"Analysis!N67","v":0},{"$f":"Y18-Z12","v":0}]
[null,"* historic figures will only be accurate if you have put the relevant data in the Data sheet"]
["Stage 2 Assessments"]
[null,"Approvals by year*",null,null,null,null,"Number who withdrew after approval*",null,null,null,null,"% Stage 2 assessments completed within 4 months (12-month rolling average for Stage 2 completions in period)*"]
[null,null,null,null,null,null,"(by year approved)",null,null,null,null,{"$f":"EDATE(M17,-1)","v":"2025-04-01"},"2025-05-01","2025-06-01","2025-07-01","2025-08-01","2025-09-01","2025-10-01","2025-11-01","2025-12-01","2026-01-01","2026-02-01",{"$f":"EDATE(X17,-1)","v":"2026-03-01"},{"$f":"RDate+1","v":"2026-04-01"}]
[null,null,null,null,null,null,null,null,null,null,null,null,null,null,null,null,null,null,null,null,null,null,null,null,{"$f":"MAX(Z12,Y33,Y49,Y62)","v":0}]
[null,{"$f":"Analysis!D2","v":"2022/23"},{"$f":"Analysis!E2","v":"2023/24"},{"$f":"Analysis!F2","v":"2024/25"},{"$f":"Analysis!$G$2&IF(AND(DAY(RDate)=31,MONTH(RDate)=3),\"\",\"*\")","v":"2025/26"},"(* = YTD)",{"$f":"B19","v":"2022/23"},{"$f":"C19","v":"2023/24"},{"$f":"D19","v":"2024/25"},{"$f":"E19","v":"2025/26"},null,{"$f":"TEXT(EDATE(L17,-12),\"mmm-yy\")&\" to \"&TEXT(L17-1,\"mmm-yy\")","v":"Apr-24 to Mar-25"},null,null,null,null,null,null,null,null,null,null,null,{"$f":"TEXT(EDATE(X17,-12),\"mmm-yy\")&\" to \"&TEXT(X17-1,\"mmm-yy\")","v":"Apr-25 to Mar-26"}]
[null,{"$f":"HLOOKUP(B19,Analysis!$B$33:$I$48,5,FALSE)","v":0},{"$f":"HLOOKUP(C19,Analysis!$B$33:$I$48,5,FALSE)","v":0},{"$f":"HLOOKUP(D19,Analysis!$B$33:$I$48,5,FALSE)","v":0},{"$f":"HLOOKUP(E19,Analysis!$B$33:$I$48,5,FALSE)","v":0},null,{"$f":"HLOOKUP(G19,Analysis!$B$33:$I$48,10,FALSE)","v":0},{"$f":"HLOOKUP(H19,Analysis!$B$33:$I$48,10,FALSE)","v":0},{"$f":"HLOOKUP(I19,Analysis!$B$33:$I$48,10,FALSE)","v":0},{"$f":"HLOOKUP(J19,Analysis!$B$33:$I$48,10,FALSE)","v":0},null,{"$f":"HLOOKUP(L17,Analysis!$B$51:$CH$63,12,FALSE)","v":""},{"$f":"HLOOKUP(M17,Analysis!$B$51:$CH$63,12,FALSE)","v":""},{"$f":"HLOOKUP(N17,Analysis!$B$51:$CH$63,12,FALSE)","v":""},{"$f":"HLOOKUP(O17,Analysis!$B$51:$CH$63,12,FALSE)","v":""},{"$f":"HLOOKUP(P17,Analysis!$B$51:$CH$63,12,FALSE)","v":""},{"$f":"HLOOKUP(Q17,Analysis!$B$51:$CH$63,12,FALSE)","v":""},{"$f":"HLOOKUP(R17,Analysis!$B$51:$CH$63,12,FALSE)","v":""},{"$f":"HLOOKUP(S17,Analysis!$B$51:$CH$63,12,FALSE)","v":""},{"$f":"HLOOKUP(T17,Analysis!$B$51:$CH$63,12,FALSE)","v":""},{"$f":"HLOOKUP(U17,Analysis!$B$51:$CH$63,12,FALSE)","v":""},{"$f":"HLOOKUP(V17,Analysis!$B$51:$CH$63,12,FALSE)","v":""},{"$f":"HLOOKUP(W17,Analysis!$B$51:$CH$63,12,FALSE)","v":""},{"$f":"HLOOKUP(X17,Analysis!$B$51:$CH$63,12,FALSE)","v":""}]
[null,"* historic figures will only be accurate if you have put the relevant data in the Data sheet",null,null,null,null,{"$f":"IF(B20>0,G20/B20,\"\")","v":""},{"$f":"IF(C20>0,H20/C20,\"\")","v":""},"",""]
[]
[null,null,"Number of households approved (12-month rolling total for approvals in period)*",null,null,null,null,null,null,null,null,null,null,null,null,null,null,"Number of households approved each month*"]
[]
[null,null,{"$f":"L19","v":"Apr-24 to Mar-25"},null,null,null,null,null,null,null,null,null,null,null,{"$f":"X19","v":"Apr-25 to Mar-26"},null,null,{"$f":"EDATE(S25,-1)","v":"2025-04-01"},{"$f":"EDATE(T25,-1)","v":"2025-05-01"},{"$f":"EDATE(U25,-1)","v":"2025-06-01"},{"$f":"EDATE(V25,-1)","v":"2025-07-01"},{"$f":"EDATE(W25,-1)","v":"2025-08-01"},{"$f":"EDATE(X25,-1)","v":"2025-09-01"},{"$f":"EDATE(Y25,-1)","v":"2025-10-01"},{"$f":"EDATE(Z25,-1)","v":"2025-11-01"},{"$f":"EDATE(AA25,-1)","v":"2025-12-01"},{"$f":"EDATE(AB25,-1)","v":"2026-01-01"},{"$f":"EDATE(AC25,-1)","v":"2026-02-01"},{"$f":"EDATE(RDate+1,-1)","v":"2026-03-01"}]
[null,null,{"$f":"HLOOKUP(L17,Analysis!$B$51:$CH$55,5,FALSE)","v":0},{"$f":"HLOOKUP(M17,Analysis!$B$51:$CH$55,5,FALSE)","v":0},{"$f":"HLOOKUP(N17,Analysis!$B$51:$CH$55,5,FALSE)","v":0},{"$f":"HLOOKUP(O17,Analysis!$B$51:$CH$55,5,FALSE)","v":0},{"$f":"HLOOKUP(P17,Analysis!$B$51:$CH$55,5,FALSE)","v":0},{"$f":"HLOOKUP(Q17,Analysis!$B$51:$CH$55,5,FALSE)","v":0},{"$f":"HLOOKUP(R17,Analysis!$B$51:$CH$55,5,FALSE)","v":0},{"$f":"HLOOKUP(S17,Analysis!$B$51:$CH$55,5,FALSE)","v":0},{"$f":"HLOOKUP(T17,Analysis!$B$51:$CH$55,5,FALSE)","v":0},{"$f":"HLOOKUP(U17,Analysis!$B$51:$CH$55,5,FALSE)","v":0},{"$f":"HLOOKUP(V17,Analysis!$B$51:$CH$55,5,FALSE)","v":0},{"$f":"HLOOKUP(W17,Analysis!$B$51:$CH$55,5,FALSE)","v":0},{"$f":"HLOOKUP(X17,Analysis!$B$51:$CH$55,5,FALSE)","v":0},null,null,{"$f":"HLOOKUP(R25,Analysis!$B$6:$CT$10,5,FALSE)","v":0},{"$f":"HLOOKUP(S25,Analysis!$B$6:$CT$10,5,FALSE)","v":0},{"$f":"HLOOKUP(T25,Analysis!$B$6:$CT$10,5,FALSE)","v":0},{"$f":"HLOOKUP(U25,Analysis!$B$6:$CT$10,5,FALSE)","v":0},{"$f":"HLOOKUP(V25,Analysis!$B$6:$CT$10,5,FALSE)","v":0},{"$f":"HLOOKUP(W25,Analysis!$B$6:$CT$10,5,FALSE)","v":0},{"$f":"HLOOKUP(X25,Analysis!$B$6:$CT$10,5,FALSE)","v":0},{"$f":"HLOOKUP(Y25,Analysis!$B$6:$CT$10,5,FALSE)","v":0},{"$f":"HLOOKUP(Z25,Analysis!$B$6:$CT$10,5,FALSE)","v":0},{"$f":"HLOOKUP(AA25,Analysis!$B$6:$CT$10,5,FALSE)","v":0},{"$f":"HLOOKUP(AB25,Analysis!$B$6:$CT$10,5,FALSE)","v":0},{"$f":"HLOOKUP(AC25,Analysis!$B$6:$CT$10,5,FALSE)","v":0}]
[null,null,null,null,null,null,null,null,null,null,null,null,null,null,null,null,null,null,{"$f":"IF(MONTH(T25)=3,\"Q4:\",IF(MONTH(T25)=12,\"Q3:\",IF(MONTH(T25)=9,\"Q2:\",\"Q1:\")))","v":"Q1:"},{"$f":"SUM(R26:T26)","v":0},null,{"$f":"IF(MONTH(W25)=3,\"Q4:\",IF(MONTH(W25)=12,\"Q3:\",IF(MONTH(W25)=9,\"Q2:\",\"Q1:\")))","v":"Q2:"},{"$f":"SUM(U26:W26)","v":0},null,{"$f":"IF(MONTH(Z25)=3,\"Q4:\",IF(MONTH(Z25)=12,\"Q3:\",IF(MONTH(Z25)=9,\"Q2:\",\"Q1:\")))","v":"Q3:"},{"$f":"SUM(X26:Z26)","v":0},null,{"$f":"IF(MONTH(AC25)=3,\"Q4:\",IF(MONTH(AC25)=12,\"Q3:\",IF(MONTH(AC25)=9,\"Q2:\",\"Q1:\")))","v":"Q4:"},{"$f":"SUM(AA26:AC26)","v":0}]
[]
[null,"Number of cases starting Stage 2*",null,null,null,null,"Number who were not approved*",null,null,null,null,{"$f":"\"Cumulative % STAGE 2 assessments completed between \"&TEXT(SDate,\"d mmmm yyyy\")&\" and \"&TEXT(RDate,\"d mmmm yyyy\")&\" by months taken to complete Stage 2*\"","v":"Cumulative % STAGE 2 assessments completed between 1 April 2023 and 31 March 2026 by months taken to complete Stage 2*"},null,null,null,null,null,null,null,null,null,null,null,null,null,{"$f":"Y33&IF(Y33=1,\" family \",\" families \")&\"currently in Stage 2\"","v":"0 families currently in Stage 2"}]
[null,"(by year)",null,null,null,null,"(by year starting Stage 2)",null,null,null,null,null,null,null,null,null,null,null,null,null,null,null,null,null,null,null,{"$f":"\"including \"&IF(Analysis!$J$72<>1,Analysis!$J$72&\" cases on hold\",Analysis!$J$72&\" case on hold\")","v":"including 0 cases on hold"}]
[null,null,null,null,null,null,null,null,null,null,null,null,null,null,null,null,null,null,null,null,null,null,null,null,null,null,"\nTime since starting Stage 2"]
[null,{"$f":"B19","v":"2022/23"},{"$f":"C19","v":"2023/24"},"2024/25","2025/26",null,{"$f":"G19","v":"2022/23"},"2023/24","2024/25","2025/26"]
[null,{"$f":"HLOOKUP(B32,Analysis!$B$33:$I$48,6,FALSE)","v":0},{"$f":"HLOOKUP(C32,Analysis!$B$33:$I$48,6,FALSE)","v":0},{"$f":"HLOOKUP(D32,Analysis!$B$33:$I$48,6,FALSE)","v":0},{"$f":"HLOOKUP(E32,Analysis!$B$33:$I$48,6,FALSE)","v":0},null,{"$f":"HLOOKUP(G32,Analysis!$B$33:$I$48,12,FALSE)","v":0},{"$f":"HLOOKUP(H32,Analysis!$B$33:$I$48,12,FALSE)","v":0},{"$f":"HLOOKUP(I32,Analysis!$B$33:$I$48,12,FALSE)","v":0},{"$f":"HLOOKUP(J32,Analysis!$B$33:$I$48,12,FALSE)","v":0},null,null,null,null,null,null,null,null,null,null,null,null,null,null,{"$f":"SUM(AA34:AD34)","v":0},null,{"$f":"AA34&\" - \"&Analysis!I70","v":"0 - Under 4 months"},{"$f":"AB34&\" - \"&Analysis!I69","v":"0 - 4-8 months"},{"$f":"AC34&\" - \"&Analysis!I68","v":"0 - 8-12 months"},{"$f":"AD34&\" - \"&Analysis!I67","v":"0 - Over 1 year"},{"$f":"Y18-Y33","v":0}]
[null,"* historic figures will only be accurate if you have put the relevant data in the Data sheet",null,null,null,null,{"$f":"IF(B33>0,G33/B33,\"\")","v":""},{"$f":"IF(C33>0,H33/C33,\"\")","v":""},{"$f":"IF(D33>0,I33/D33,\"\")","v":""},{"$f":"IF(E33>0,J33/E33,\"\")","v":""},null,null,null,null,null,null,null,null,null,null,null,null,null,null,null,null,{"$f":"Analysis!J70","v":0},{"$f":"Analysis!J69","v":0},{"$f":"Analysis!J68","v":0},{"$f":"Analysis!J67","v":0}]
[]
[null,null,"Number of households starting Stage 2 (12-month rolling total for assessments started in period)*",null,null,null,null,null,null,null,null,null,null,null,null,null,null,"Number of households starting Stage 2 each month*"]
[]
[null,null,{"$f":"C25","v":"Apr-24 to Mar-25"},null,null,null,null,null,null,null,null,null,null,null,{"$f":"O25","v":"Apr-25 to Mar-26"},null,null,{"$f":"EDATE(S38,-1)","v":"2025-04-01"},{"$f":"EDATE(T38,-1)","v":"2025-05-01"},{"$f":"EDATE(U38,-1)","v":"2025-06-01"},{"$f":"EDATE(V38,-1)","v":"2025-07-01"},{"$f":"EDATE(W38,-1)","v":"2025-08-01"},{"$f":"EDATE(X38,-1)","v":"2025-09-01"},{"$f":"EDATE(Y38,-1)","v":"2025-10-01"},{"$f":"EDATE(Z38,-1)","v":"2025-11-01"},{"$f":"EDATE(AA38,-1)","v":"2025-12-01"},{"$f":"EDATE(AB38,-1)","v":"2026-01-01"},{"$f":"EDATE(AC38,-1)","v":"2026-02-01"},{"$f":"EDATE(RDate+1,-1)","v":"2026-03-01"}]
[null,null,{"$f":"HLOOKUP(L17,Analysis!$B$51:$CH$56,6,FALSE)","v":0},{"$f":"HLOOKUP(M17,Analysis!$B$51:$CH$56,6,FALSE)","v":0},{"$f":"HLOOKUP(N17,Analysis!$B$51:$CH$56,6,FALSE)","v":0},{"$f":"HLOOKUP(O17,Analysis!$B$51:$CH$56,6,FALSE)","v":0},{"$f":"HLOOKUP(P17,Analysis!$B$51:$CH$56,6,FALSE)","v":0},{"$f":"HLOOKUP(Q17,Analysis!$B$51:$CH$56,6,FALSE)","v":0},{"$f":"HLOOKUP(R17,Analysis!$B$51:$CH$56,6,FALSE)","v":0},{"$f":"HLOOKUP(S17,Analysis!$B$51:$CH$56,6,FALSE)","v":0},{"$f":"HLOOKUP(T17,Analysis!$B$51:$CH$56,6,FALSE)","v":0},{"$f":"HLOOKUP(U17,Analysis!$B$51:$CH$56,6,FALSE)","v":0},{"$f":"HLOOKUP(V17,Analysis!$B$51:$CH$56,6,FALSE)","v":0},{"$f":"HLOOKUP(W17,Analysis!$B$51:$CH$56,6,FALSE)","v":0},{"$f":"HLOOKUP(X17,Analysis!$B$51:$CH$56,6,FALSE)","v":0},null,null,{"$f":"HLOOKUP(R38,Analysis!$B$6:$CT$11,6,FALSE)","v":0},{"$f":"HLOOKUP(S38,Analysis!$B$6:$CT$11,6,FALSE)","v":0},{"$f":"HLOOKUP(T38,Analysis!$B$6:$CT$11,6,FALSE)","v":0},{"$f":"HLOOKUP(U38,Analysis!$B$6:$CT$11,6,FALSE)","v":0},{"$f":"HLOOKUP(V38,Analysis!$B$6:$CT$11,6,FALSE)","v":0},{"$f":"HLOOKUP(W38,Analysis!$B$6:$CT$11,6,FALSE)","v":0},{"$f":"HLOOKUP(X38,Analysis!$B$6:$CT$11,6,FALSE)","v":0},{"$f":"HLOOKUP(Y38,Analysis!$B$6:$CT$11,6,FALSE)","v":0},{"$f":"HLOOKUP(Z38,Analysis!$B$6:$CT$11,6,FALSE)","v":0},{"$f":"HLOOKUP(AA38,Analysis!$B$6:$CT$11,6,FALSE)","v":0},{"$f":"HLOOKUP(AB38,Analysis!$B$6:$CT$11,6,FALSE)","v":0},{"$f":"HLOOKUP(AC38,Analysis!$B$6:$CT$11,6,FALSE)","v":0}]
[null,null,null,null,null,null,null,null,null,null,null,null,null,null,null,null,null,null,{"$f":"IF(MONTH(T38)=3,\"Q4:\",IF(MONTH(T38)=12,\"Q3:\",IF(MONTH(T38)=9,\"Q2:\",\"Q1:\")))","v":"Q1:"},{"$f":"SUM(R39:T39)","v":0},null,{"$f":"IF(MONTH(W38)=3,\"Q4:\",IF(MONTH(W38)=12,\"Q3:\",IF(MONTH(W38)=9,\"Q2:\",\"Q1:\")))","v":"Q2:"},{"$f":"SUM(U39:W39)","v":0},null,{"$f":"IF(MONTH(Z38)=3,\"Q4:\",IF(MONTH(Z38)=12,\"Q3:\",IF(MONTH(Z38)=9,\"Q2:\",\"Q1:\")))","v":"Q3:"},{"$f":"SUM(X39:Z39)","v":0},null,{"$f":"IF(MONTH(AC38)=3,\"Q4:\",IF(MONTH(AC38)=12,\"Q3:\",IF(MONTH(AC38)=9,\"Q2:\",\"Q1:\")))","v":"Q4:"},{"$f":"SUM(AA39:AC39)","v":0}]
[{"$f":"Analysis!$C$1&\" - Adopters Journey Dashboard as at \"&TEXT(RDate,\"d mmmm yyyy\")&\" (page 2 of 2)\"","v":"0 - Adopters Journey Dashboard as at 31 March 2026 (page 2 of 2)"}]
[]
["Stage 1 Pre-assessments"]
[null,"Number of cases completing Stage 1*",null,null,null,null,"Number who withdrew before Stage 2*",null,null,null,null,"% STAGE 1 pre-assessments completed within 2 months (12-month rolling average for Stage 1 completions in period)*",null,null,null,null,null,null,null,null,null,null,null,null,null,{"$f":"Y49&IF(Y49=1,\" family \",\" families \")&\"currently between Stage 1 and Stage 2\"","v":"0 families currently between Stage 1 and Stage 2"}]
[null,"(by year)",null,null,null,null,"(by year completing Stage 1)"]
[null,null,null,null,null,null,null,null,null,null,null,null,null,null,null,null,null,null,null,null,null,null,null,null,null,null,"\nTime since completing Stage 1"]
[null,{"$f":"B19","v":"2022/23"},{"$f":"C19","v":"2023/24"},"2024/25","2025/26",null,{"$f":"G19","v":"2022/23"},"2023/24","2024/25","2025/26",null,{"$f":"L19","v":"Apr-24 to Mar-25"},null,null,null,null,null,null,null,null,null,null,null,{"$f":"X19","v":"Apr-25 to Mar-26"}]
[null,{"$f":"HLOOKUP(B47,Analysis!$B$33:$I$48,7,FALSE)","v":0},{"$f":"HLOOKUP(C47,Analysis!$B$33:$I$48,7,FALSE)","v":0},{"$f":"HLOOKUP(D47,Analysis!$B$33:$I$48,7,FALSE)","v":0},{"$f":"HLOOKUP(E47,Analysis!$B$33:$I$48,7,FALSE)","v":0},null,{"$f":"HLOOKUP(G47,Analysis!$B$33:$I$48,15,FALSE)","v":0},{"$f":"HLOOKUP(H47,Analysis!$B$33:$I$48,15,FALSE)","v":0},{"$f":"HLOOKUP(I47,Analysis!$B$33:$I$48,15,FALSE)","v":0},{"$f":"HLOOKUP(J47,Analysis!$B$33:$I$48,15,FALSE)","v":0},null,{"$f":"HLOOKUP(L17,Analysis!$B$51:$CH$63,13,FALSE)","v":""},{"$f":"HLOOKUP(M17,Analysis!$B$51:$CH$63,13,FALSE)","v":""},{"$f":"HLOOKUP(N17,Analysis!$B$51:$CH$63,13,FALSE)","v":""},{"$f":"HLOOKUP(O17,Analysis!$B$51:$CH$63,13,FALSE)","v":""},{"$f":"HLOOKUP(P17,Analysis!$B$51:$CH$63,13,FALSE)","v":""},{"$f":"HLOOKUP(Q17,Analysis!$B$51:$CH$63,13,FALSE)","v":""},{"$f":"HLOOKUP(R17,Analysis!$B$51:$CH$63,13,FALSE)","v":""},{"$f":"HLOOKUP(S17,Analysis!$B$51:$CH$63,13,FALSE)","v":""},{"$f":"HLOOKUP(T17,Analysis!$B$51:$CH$63,13,FALSE)","v":""},{"$f":"HLOOKUP(U17,Analysis!$B$51:$CH$63,13,FALSE)","v":""},{"$f":"HLOOKUP(V17,Analysis!$B$51:$CH$63,13,FALSE)","v":""},{"$f":"HLOOKUP(W17,Analysis!$B$51:$CH$63,13,FALSE)","v":""},{"$f":"HLOOKUP(X17,Analysis!$B$51:$CH$63,13,FALSE)","v":""},null,null,{"$f":"AA49&\" - \"&Analysis!E68","v":"0 - Under 6 months"},{"$f":"AB49&\" - \"&Analysis!E67","v":"0 - Over 6 months"}]
[null,"* historic figures will only be accurate if you have put the relevant data in the Data sheet",null,null,null,null,{"$f":"IF(B48>0,G48/B48,\"\")","v":""},{"$f":"IF(C48>0,H48/C48,\"\")","v":""},{"$f":"IF(D48>0,I48/D48,\"\")","v":""},{"$f":"IF(E48>0,J48/E48,\"\")","v":""},null,null,null,null,null,null,null,null,null,null,null,null,null,null,{"$f":"SUM(AA49:AB49)","v":0},null,{"$f":"Analysis!F68","v":0},{"$f":"Analysis!F67","v":0},{"$f":"Y18-Y49","v":0},{"$f":"MAX(B48:J48)","v":0}]
[]
[null,null,"Number of households completing Stage 1 (12-month rolling total for pre-assessments completed in period)*",null,null,null,null,null,null,null,null,null,null,null,null,null,null,"Number of households completing Stage 1 each month*"]
[]
[null,null,{"$f":"C38","v":"Apr-24 to Mar-25"},null,null,null,null,null,null,null,null,null,null,null,{"$f":"O38","v":"Apr-25 to Mar-26"},null,null,{"$f":"EDATE(S53,-1)","v":"2025-04-01"},{"$f":"EDATE(T53,-1)","v":"2025-05-01"},{"$f":"EDATE(U53,-1)","v":"2025-06-01"},{"$f":"EDATE(V53,-1)","v":"2025-07-01"},{"$f":"EDATE(W53,-1)","v":"2025-08-01"},{"$f":"EDATE(X53,-1)","v":"2025-09-01"},{"$f":"EDATE(Y53,-1)","v":"2025-10-01"},{"$f":"EDATE(Z53,-1)","v":"2025-11-01"},{"$f":"EDATE(AA53,-1)","v":"2025-12-01"},{"$f":"EDATE(AB53,-1)","v":"2026-01-01"},{"$f":"EDATE(AC53,-1)","v":"2026-02-01"},{"$f":"EDATE(RDate+1,-1)","v":"2026-03-01"}]
[null,null,{"$f":"HLOOKUP(L17,Analysis!$B$51:$CH$57,7,FALSE)","v":0},{"$f":"HLOOKUP(M17,Analysis!$B$51:$CH$57,7,FALSE)","v":0},{"$f":"HLOOKUP(N17,Analysis!$B$51:$CH$57,7,FALSE)","v":0},{"$f":"HLOOKUP(O17,Analysis!$B$51:$CH$57,7,FALSE)","v":0},{"$f":"HLOOKUP(P17,Analysis!$B$51:$CH$57,7,FALSE)","v":0},{"$f":"HLOOKUP(Q17,Analysis!$B$51:$CH$57,7,FALSE)","v":0},{"$f":"HLOOKUP(R17,Analysis!$B$51:$CH$57,7,FALSE)","v":0},{"$f":"HLOOKUP(S17,Analysis!$B$51:$CH$57,7,FALSE)","v":0},{"$f":"HLOOKUP(T17,Analysis!$B$51:$CH$57,7,FALSE)","v":0},{"$f":"HLOOKUP(U17,Analysis!$B$51:$CH$57,7,FALSE)","v":0},{"$f":"HLOOKUP(V17,Analysis!$B$51:$CH$57,7,FALSE)","v":0},{"$f":"HLOOKUP(W17,Analysis!$B$51:$CH$57,7,FALSE)","v":0},{"$f":"HLOOKUP(X17,Analysis!$B$51:$CH$57,7,FALSE)","v":0},null,null,{"$f":"HLOOKUP(R53,Analysis!$B$6:$CT$12,7,FALSE)","v":0},{"$f":"HLOOKUP(S53,Analysis!$B$6:$CT$12,7,FALSE)","v":0},{"$f":"HLOOKUP(T53,Analysis!$B$6:$CT$12,7,FALSE)","v":0},{"$f":"HLOOKUP(U53,Analysis!$B$6:$CT$12,7,FALSE)","v":0},{"$f":"HLOOKUP(V53,Analysis!$B$6:$CT$12,7,FALSE)","v":0},{"$f":"HLOOKUP(W53,Analysis!$B$6:$CT$12,7,FALSE)","v":0},{"$f":"HLOOKUP(X53,Analysis!$B$6:$CT$12,7,FALSE)","v":0},{"$f":"HLOOKUP(Y53,Analysis!$B$6:$CT$12,7,FALSE)","v":0},{"$f":"HLOOKUP(Z53,Analysis!$B$6:$CT$12,7,FALSE)","v":0},{"$f":"HLOOKUP(AA53,Analysis!$B$6:$CT$12,7,FALSE)","v":0},{"$f":"HLOOKUP(AB53,Analysis!$B$6:$CT$12,7,FALSE)","v":0},{"$f":"HLOOKUP(AC53,Analysis!$B$6:$CT$12,7,FALSE)","v":0}]
[null,null,null,null,null,null,null,null,null,null,null,null,null,null,null,null,null,null,{"$f":"IF(MONTH(T53)=3,\"Q4:\",IF(MONTH(T53)=12,\"Q3:\",IF(MONTH(T53)=9,\"Q2:\",\"Q1:\")))","v":"Q1:"},{"$f":"SUM(R54:T54)","v":0},null,{"$f":"IF(MONTH(W53)=3,\"Q4:\",IF(MONTH(W53)=12,\"Q3:\",IF(MONTH(W53)=9,\"Q2:\",\"Q1:\")))","v":"Q2:"},{"$f":"SUM(U54:W54)","v":0},null,{"$f":"IF(MONTH(Z53)=3,\"Q4:\",IF(MONTH(Z53)=12,\"Q3:\",IF(MONTH(Z53)=9,\"Q2:\",\"Q1:\")))","v":"Q3:"},{"$f":"SUM(X54:Z54)","v":0},null,{"$f":"IF(MONTH(AC53)=3,\"Q4:\",IF(MONTH(AC53)=12,\"Q3:\",IF(MONTH(AC53)=9,\"Q2:\",\"Q1:\")))","v":"Q4:"},{"$f":"SUM(AA54:AC54)","v":0}]
[]
[null,"Number of cases starting Stage 1*",null,null,null,null,"Number who did not progress from Stage 1*",null,null,null,null,{"$f":"\"Cumulative % STAGE 1 pre-assessments completed between \"&TEXT(SDate,\"d mmmm yyyy\")&\" and \"&TEXT(RDate,\"d mmmm yyyy\")&\" by months taken to complete Stage 1*\"","v":"Cumulative % STAGE 1 pre-assessments completed between 1 April 2023 and 31 March 2026 by months taken to complete Stage 1*"},null,null,null,null,null,null,null,null,null,null,null,null,null,{"$f":"Y62&IF(Y62=1,\" family \",\" families \")&\"currently in Stage 1\"","v":"0 families currently in Stage 1"}]
[null,"(by year)",null,null,null,null,"(by year starting Stage 1)",null,null,null,null,null,null,null,null,null,null,null,null,null,null,null,null,null,null,null,{"$f":"\"including \"&IF(Analysis!$B$72<>1,Analysis!$B$72&\" cases on hold\",Analysis!$B$72&\" case on hold\")","v":"including 0 cases on hold"}]
[null,null,null,null,null,null,null,null,null,null,null,null,null,null,null,null,null,null,null,null,null,null,null,null,null,null,"\nTime since starting Stage 1"]
[null,{"$f":"B19","v":"2022/23"},{"$f":"C19","v":"2023/24"},"2024/25","2025/26",null,{"$f":"G19","v":"2022/23"},"2023/24","2024/25","2025/26"]
[null,{"$f":"HLOOKUP(B60,Analysis!$B$33:$I$48,8,FALSE)","v":0},{"$f":"HLOOKUP(C60,Analysis!$B$33:$I$48,8,FALSE)","v":0},{"$f":"HLOOKUP(D60,Analysis!$B$33:$I$48,8,FALSE)","v":0},{"$f":"HLOOKUP(E60,Analysis!$B$33:$I$48,8,FALSE)","v":0},null,{"$f":"HLOOKUP(G60,Analysis!$B$33:$I$48,14,FALSE)","v":0},{"$f":"HLOOKUP(H60,Analysis!$B$33:$I$48,14,FALSE)","v":0},{"$f":"HLOOKUP(I60,Analysis!$B$33:$I$48,14,FALSE)","v":0},{"$f":"HLOOKUP(J60,Analysis!$B$33:$I$48,14,FALSE)","v":0},null,null,null,null,null,null,null,null,null,null,null,null,null,null,null,null,{"$f":"AA62&\" - \"&Analysis!A68","v":"0 - Under 2 months"},{"$f":"AB62&\" - \"&Analysis!A67","v":"0 - Over 2 months"}]
[null,"* historic figures will only be accurate if you have put the relevant data in the Data sheet",null,null,null,null,{"$f":"IF(B61>0,G61/B61,\"\")","v":""},{"$f":"IF(C61>0,H61/C61,\"\")","v":""},{"$f":"IF(D61>0,I61/D61,\"\")","v":""},{"$f":"IF(E61>0,J61/E61,\"\")","v":""},null,null,null,null,null,null,null,null,null,null,null,null,null,null,{"$f":"SUM(AA62:AB62)","v":0},null,{"$f":"Analysis!B68","v":0},{"$f":"Analysis!B67","v":0},{"$f":"Y18-Y62","v":0},{"$f":"MAX(B61:J61)","v":0}]
[]
[null,null,"Number of households starting Stage 1 (12-month rolling total for pre-assessments started in period)*",null,null,null,null,null,null,null,null,null,null,null,null,null,null,"Number of households starting Stage 1 each month*"]
[]
[null,null,{"$f":"C53","v":"Apr-24 to Mar-25"},null,null,null,null,null,null,null,null,null,null,null,{"$f":"O53","v":"Apr-25 to Mar-26"},null,null,{"$f":"EDATE(S66,-1)","v":"2025-04-01"},{"$f":"EDATE(T66,-1)","v":"2025-05-01"},{"$f":"EDATE(U66,-1)","v":"2025-06-01"},{"$f":"EDATE(V66,-1)","v":"2025-07-01"},{"$f":"EDATE(W66,-1)","v":"2025-08-01"},{"$f":"EDATE(X66,-1)","v":"2025-09-01"},{"$f":"EDATE(Y66,-1)","v":"2025-10-01"},{"$f":"EDATE(Z66,-1)","v":"2025-11-01"},{"$f":"EDATE(AA66,-1)","v":"2025-12-01"},{"$f":"EDATE(AB66,-1)","v":"2026-01-01"},{"$f":"EDATE(AC66,-1)","v":"2026-02-01"},{"$f":"EDATE(RDate+1,-1)","v":"2026-03-01"}]
[null,null,{"$f":"HLOOKUP(L17,Analysis!$B$51:$CH$58,8,FALSE)","v":0},{"$f":"HLOOKUP(M17,Analysis!$B$51:$CH$58,8,FALSE)","v":0},{"$f":"HLOOKUP(N17,Analysis!$B$51:$CH$58,8,FALSE)","v":0},{"$f":"HLOOKUP(O17,Analysis!$B$51:$CH$58,8,FALSE)","v":0},{"$f":"HLOOKUP(P17,Analysis!$B$51:$CH$58,8,FALSE)","v":0},{"$f":"HLOOKUP(Q17,Analysis!$B$51:$CH$58,8,FALSE)","v":0},{"$f":"HLOOKUP(R17,Analysis!$B$51:$CH$58,8,FALSE)","v":0},{"$f":"HLOOKUP(S17,Analysis!$B$51:$CH$58,8,FALSE)","v":0},{"$f":"HLOOKUP(T17,Analysis!$B$51:$CH$58,8,FALSE)","v":0},{"$f":"HLOOKUP(U17,Analysis!$B$51:$CH$58,8,FALSE)","v":0},{"$f":"HLOOKUP(V17,Analysis!$B$51:$CH$58,8,FALSE)","v":0},{"$f":"HLOOKUP(W17,Analysis!$B$51:$CH$58,8,FALSE)","v":0},{"$f":"HLOOKUP(X17,Analysis!$B$51:$CH$58,8,FALSE)","v":0},null,null,{"$f":"HLOOKUP(R66,Analysis!$B$6:$CT$13,8,FALSE)","v":0},{"$f":"HLOOKUP(S66,Analysis!$B$6:$CT$13,8,FALSE)","v":0},{"$f":"HLOOKUP(T66,Analysis!$B$6:$CT$13,8,FALSE)","v":0},{"$f":"HLOOKUP(U66,Analysis!$B$6:$CT$13,8,FALSE)","v":0},{"$f":"HLOOKUP(V66,Analysis!$B$6:$CT$13,8,FALSE)","v":0},{"$f":"HLOOKUP(W66,Analysis!$B$6:$CT$13,8,FALSE)","v":0},{"$f":"HLOOKUP(X66,Analysis!$B$6:$CT$13,8,FALSE)","v":0},{"$f":"HLOOKUP(Y66,Analysis!$B$6:$CT$13,8,FALSE)","v":0},{"$f":"HLOOKUP(Z66,Analysis!$B$6:$CT$13,8,FALSE)","v":0},{"$f":"HLOOKUP(AA66,Analysis!$B$6:$CT$13,8,FALSE)","v":0},{"$f":"HLOOKUP(AB66,Analysis!$B$6:$CT$13,8,FALSE)","v":0},{"$f":"HLOOKUP(AC66,Analysis!$B$6:$CT$13,8,FALSE)","v":0}]
[null,null,null,null,null,null,null,null,null,null,null,null,null,null,null,null,null,null,{"$f":"IF(MONTH(T66)=3,\"Q4:\",IF(MONTH(T66)=12,\"Q3:\",IF(MONTH(T66)=9,\"Q2:\",\"Q1:\")))","v":"Q1:"},{"$f":"SUM(R67:T67)","v":0},null,{"$f":"IF(MONTH(W66)=3,\"Q4:\",IF(MONTH(W66)=12,\"Q3:\",IF(MONTH(W66)=9,\"Q2:\",\"Q1:\")))","v":"Q2:"},{"$f":"SUM(U67:W67)","v":0},null,{"$f":"IF(MONTH(Z66)=3,\"Q4:\",IF(MONTH(Z66)=12,\"Q3:\",IF(MONTH(Z66)=9,\"Q2:\",\"Q1:\")))","v":"Q3:"},{"$f":"SUM(X67:Z67)","v":0},null,{"$f":"IF(MONTH(AC66)=3,\"Q4:\",IF(MONTH(AC66)=12,\"Q3:\",IF(MONTH(AC66)=9,\"Q2:\",\"Q1:\")))","v":"Q4:"},{"$f":"SUM(AA67:AC67)","v":0}]

{"sheet":"Queries","index":4,"n_rows":1,"n_cols":3,"rows_kept":1,"cut":false,"hidden":false,"merged":[]}
["Adopter ID","Field","Query"]

{"sheet":"Glossary","index":5,"n_rows":78,"n_cols":3,"rows_kept":78,"cut":false,"hidden":false,"merged":[]}
[]
[null,"A4   Gender"]
[null,0,"Not known (gender not recorded)"]
[null,1,"Male"]
[null,2,"Female"]
[null,3,"Non-binary"]
[null,4,"Transgender Man (Trans Man)"]
[null,5,"Transgender Woman (Trans Woman)"]
[null,6,"Other gender identity"]
[null,7,"Gender identity the same as sex registered at birth but no specific identity given"]
[null,8,"Gender identity different from sex registered at birth but no specific identity given"]
[null,9,"Neither (indeterminate, i.e. unable to be classed as either male or female)"]
[]
[null,"A6   Religion"]
[null,"Bu","Buddhist"]
[null,"Ch","Christian"]
[null,"Hi","Hindu"]
[null,"Je","Jewish"]
[null,"Mu","Muslim"]
[null,"No","None"]
[null,"Ot","Other"]
[null,"Re","Refused"]
[null,"Na","No information available"]
[]
[null,"A7   Sexual orientation"]
[null,"He","Heterosexual"]
[null,"Ga","Gay"]
[null,"Le","Lesbian"]
[null,"Bi","Bisexual"]
[null,"Ot","Other"]
[null,"Pa","Pansexual"]
[null,"Po","Polysexual"]
[null,"Qu","Queer"]
[null,"Na","No information available"]
[null,"Re","Refused"]
[]
[null,"A8   Ethnic origin"]
[null,"WBRI","White – British"]
[null,"WIRI","White – Irish"]
[null,"WIRT","White – Traveller of Irish heritage"]
[null,"WROM","White – Gypsy/Roma"]
[null,"WOTH","Any other White background"]
[null,"ABAN","Asian – Bangladeshi"]
[null,"AIND","Asian – Indian"]
[null,"APKN","Asian – Pakistani"]
[null,"AOTH","Any other Asian background"]
[null,"CHNE","Chinese"]
[null,"BAFR","Black African"]
[null,"BCRB","Black Caribbean"]
[null,"BOTH","Any other Black background"]
[null,"MWAS","Mixed – White and Asian"]
[null,"MWBA","Mixed – White and Black African"]
[null,"MWBC","Mixed – White and Black Caribbean"]
[null,"MOTH","Any other mixed background"]
[null,"OOTH","Any other ethnic group"]
[null,"REFU","Refused"]
[null,"NOBT","Information not yet obtained"]
[]
[null,"A10   Relationship status"]
[null,"SIN","Single"]
[null,"MAR","Married"]
[null,"CIV","Civil partnership"]
[null,"CLM","Male/female partnership"]
[null,"SSP","Same sex partnership"]
[null,"OTH","Other"]
[null,"REFU","Refused"]
[null,"NOBT","Information not yet obtained"]
[]
[null,"C2b   Reason for leaving adoption process"]
[null,1,"(Prospective) adopter withdrew from the adoption process"]
[null,2,"The adoption process was put on hold"]
[null,3,"The application was refused"]
[]
[null,"D1  Adopter Family Finding codes"]
[null,"1 ","Currently family-finding for the family"]
[null,"2 ","Not family-finding – expected to go on hold or withdraw from the process"]
[null,"3 ","Not family-finding – child found but not yet formally matched at panel "]
[null,"4 ","Not family-finding – other reason"]

{"sheet":"URN","index":6,"n_rows":172,"n_cols":7,"rows_kept":172,"cut":false,"hidden":false,"merged":[]}
["New-style Ofsted URN","Old-style Ofsted URN","DfE Code","Child's Adoption Agency","Provision Type","Registration Date","Closure Date of Child Agency"]
[1023087,"SC053472",301,"Barking and Dagenham","LA","2003-09-02"]
[1023129,"SC054951",302,"Barnet","LA","2003-09-22"]
[1022968,"SC050108",370,"Barnsley","LA","2007-03-31"]
[1022969,"SC050122",800,"Bath and North East Somerset","LA","2003-07-16"]
[1026019,"SC454369",822,"Bedford","LA","2012-08-24"]
[1023088,"SC053480",303,"Bexley","LA","2003-09-02"]
[1022947,"SC050034","213B","Bi-Borough","LA","2019-10-01"]
[1273493,"SC053481",330,"Birmingham","LA","2003-09-02","2018-03-18"]
[1273493,1273493,330,"Birmingham","LA (VAA)","2018-03-19"]
[1022922,"SC049186",889,"Blackburn with Darwen","LA","2003-07-02"]
[1023208,"SC056531",890,"Blackpool","LA","2003-10-22"]
[1023268,"SC057273",350,"Bolton","LA","2003-11-05"]
[1023130,"SC054957",837,"Bournemouth","LA","1990-01-01","2019-03-31"]
[2533843,2533843,837,"Bournemouth, Christchurch, Poole","LA","2019-04-01"]
[1023376,"SC059849",867,"Bracknell Forest","LA","2004-02-02"]
[2730622,2730622,380,"Bradford","LA","2023-04-01"]
[1023131,"SC054963",380,"Bradford","LA","2003-09-24","31/02/2023"]
[1023309,"SC058592",304,"Brent","LA","2003-12-01"]
[1022963,"SC050073",846,"Brighton and Hove","LA","2003-07-15"]
[1023132,"SC054985",801,"Bristol","LA","2003-09-23"]
[1023102,"SC054048",305,"Bromley","LA","2003-09-09"]
[1023166,"SC055713",825,"Buckinghamshire","LA","2003-10-07"]
[1022942,"SC049997",351,"Bury","LA","2003-07-14"]
[1022943,"SC050029",381,"Calderdale","LA","2003-07-15"]
[1022900,"SC048977",873,"Cambridgeshire","LA","2003-06-27"]
[1022946,"SC050033",202,"Camden","LA","2003-07-15"]
[1025048,"SC394407",823,"Central Bedfordshire","LA","2009-04-20"]
[1025028,"SC393773",895,"Cheshire East","LA","2009-04-02"]
[1025030,"SC393778",896,"Cheshire West and Chester","LA","2009-04-02"]
[1023379,"SC059857",201,"City of London","LA","2004-02-02"]
[1023134,"SC054995",908,"Cornwall","LA","2003-09-23"]
[1023135,"SC055002",331,"Coventry","LA","2003-09-23"]
[1023353,"SC059610",306,"Croydon","LA","2004-01-20"]
[1023099,"SC054013",909,"Cumbria","LA","2003-09-09","2023-03-31"]
[2733364,2733364,null,"Cumberland","LA","2023-04-01"]
[1024027,"SC067257",841,"Darlington","LA","2006-03-03"]
[1023334,"SC059360",831,"Derby","LA","2004-01-09"]
[1023347,"SC059568",830,"Derbyshire","LA","2004-01-19"]
[1022944,"SC050030",878,"Devon","LA","2003-07-15"]
["SC481450","SC055015",371,"Doncaster","LA","1990-01-01","2014-09-27"]
["SC481450","SC481450",371,"Doncaster","LA (VAA)","2014-09-28"]
[1022945,"SC050031",835,"Dorset","LA","2003-07-15"]
[1023137,"SC055017",332,"Dudley","LA","2003-09-23"]
[1023139,"SC055022",840,"Durham","LA","2003-09-23"]
[1023140,"SC055023",307,"Ealing","LA","2003-09-23"]
[1023209,"SC056538",811,"East Riding of Yorkshire","LA","2003-10-22"]
[1023009,"SC050780",845,"East Sussex","LA","2003-07-28"]
[1023141,"SC055062",308,"Enfield","LA","2003-09-23"]
[1023142,"SC055065",881,"Essex","LA","2003-09-23"]
[1023143,"SC055067",390,"Gateshead","LA","2003-09-23"]
[1023156,"SC055643",916,"Gloucestershire","LA","2003-10-06"]
[1023308,"SC058590",203,"Greenwich","LA","2003-12-01"]
[1023145,"SC055128",204,"Hackney","LA","2003-09-24"]
[1022919,"SC049148",876,"Halton","LA","2003-07-01"]
[1022962,"SC050069",205,"Hammersmith and Fulham","LA","2019-10-01"]
[1023152,"SC055359",850,"Hampshire","LA","2003-09-29"]
[1023150,"SC055355",309,"Haringey","LA","2003-09-29"]
[1023350,"SC059588",310,"Harrow","LA","2004-01-19"]
[1023158,"SC055687",805,"Hartlepool","LA","2003-10-06"]
[1023159,"SC055691",311,"Havering","LA","2003-10-06"]
[1023291,"SC057941",884,"Herefordshire","LA","2003-11-19"]
[1023160,"SC055695",919,"Hertfordshire","LA","2003-10-06"]
[1023161,"SC055697",312,"Hillingdon","LA","2003-10-06"]
[1023162,"SC055699",313,"Hounslow","LA","2003-10-06"]
["xxIOM","xxIOM",null,"Isle of Man ","LA outside England"]
[1023163,"SC055702",921,"Isle of Wight","LA","2003-10-06"]
[1024025,"SC067253",420,"Isles of Scilly","LA","2006-03-03"]
[1023164,"SC055709",206,"Islington","LA","2003-10-07"]
[null,null,207,"Kensington and Chelsea","LA","1990-01-01","2011-05-31"]
[1023168,"SC055722",886,"Kent","LA","2003-10-07"]
[1023210,"SC056542",810,"Kingston upon Hull","LA","2003-10-22"]
[1023211,"SC056549",314,"Kingston upon Thames","LA","2003-10-22"]
[1023212,"SC056554",382,"Kirklees","LA","2003-10-22"]
[1023213,"SC056558",340,"Knowsley","LA","2003-10-22"]
[1023240,"SC056817",208,"Lambeth","LA","2003-10-28"]
[1023214,"SC056564",888,"Lancashire","LA","2003-10-22"]
[1023215,"SC056566",383,"Leeds","LA","2003-10-22"]
[1023256,"SC057149",856,"Leicester","LA","2003-11-03"]
[1023257,"SC057151",855,"Leicestershire","LA","2003-11-03"]
[1023243,"SC056854",209,"Lewisham","LA","2003-10-28"]
[1023216,"SC056568",925,"Lincolnshire","LA","2003-10-22"]
[1023220,"SC056748",341,"Liverpool","LA","2003-10-27"]
[1023221,"SC056751",821,"Luton","LA","2003-10-27"]
[1023222,"SC056753",352,"Manchester","LA","2003-10-27"]
[1023348,"SC059573",887,"Medway","LA","2004-01-19"]
[1023287,"SC057813",315,"Merton","LA","2003-11-17"]
[1022948,"SC050035",806,"Middlesbrough","LA","2003-07-15"]
[1023312,"SC058675",826,"Milton Keynes","LA","2003-12-02"]
[1022949,"SC050036",391,"Newcastle upon Tyne","LA","2003-07-15"]
[1023223,"SC056754",316,"Newham","LA","2003-10-27"]
[1023224,"SC056760",926,"Norfolk","LA","2003-10-27"]
[1023262,"SC057231",812,"North East Lincolnshire","LA","2003-11-04"]
[1022950,"SC050040",813,"North Lincolnshire","LA","2003-07-15"]
[1023226,"SC056766",802,"North Somerset","LA","2003-10-27"]
[1023227,"SC056767",392,"North Tyneside","LA","2003-10-27"]
[1023228,"SC056771",815,"North Yorkshire","LA","2003-10-27"]
[2605174,2605174,928,"Northamptonshire","LA (VAA)","2020-11-01"]
[1023225,"SC056764",928,"Northamptonshire","LA","2003-10-27","2020-10-31"]
["xxNIRE","xxNIRE",null,"Northern Ireland","LA outside England"]
[1022951,"SC050042",929,"Northumberland","LA","2003-07-15"]
[1023108,"SC054186",892,"Nottingham","LA","2003-09-10"]
[1023229,"SC056772",891,"Nottinghamshire","LA","2003-10-27"]
[1022953,"SC050044",353,"Oldham","LA","2003-07-15"]
["xxOTUK","xxOTUK",null,"Other UK","LA outside England",null,"2023-09-30"]
["xxOUUK","xxOUUK",null,"Outside UK","LA outside England"]
[1023230,"SC056777",931,"Oxfordshire","LA","2003-10-27"]
[1023170,"SC055738",874,"Peterborough","LA","2003-10-07"]
[1023231,"SC056793",879,"Plymouth","LA","2003-10-27"]
[1022954,"SC050048",836,"Poole","LA","1990-01-01","2019-03-31"]
[1022921,"SC049177",851,"Portsmouth","LA","2003-07-02"]
[2509643,"SC056833",870,"Reading","LA","2003-10-28","2018-11-28"]
[2509643,2509643,870,"Reading","LA (VAA)","2018-11-29"]
[1023107,"SC054181",317,"Redbridge","LA","2003-09-10"]
[1023109,"SC054192",807,"Redcar and Cleveland","LA","2003-09-10"]
[1023232,"SC056797",318,"Richmond upon Thames","LA","2003-10-27"]
[1023233,"SC056804",354,"Rochdale","LA","2003-10-27"]
[1023234,"SC056805",372,"Rotherham","LA","2003-10-27"]
[1023255,"SC057145",857,"Rutland","LA","2003-11-03"]
[1023235,"SC056806",355,"Salford","LA","2003-10-27"]
[1264707,"SC059602",333,"Sandwell","LA","2004-01-20","2018-03-06"]
[1264707,"SC059602",333,"Sandwell","LA (VAA)","2018-03-07"]
["xxSCOT","xxSCOT",null,"Scotland","LA outside England"]
[1023236,"SC056808",343,"Sefton","LA","2003-10-27"]
[1023296,"SC058208",373,"Sheffield","LA","2003-11-24"]
[1023275,"SC057549",893,"Shropshire","LA","2003-11-10"]
[1183499,"SC056811",871,"Slough","LA","1990-01-01","2015-09-29"]
[1183499,1183499,871,"Slough","LA (VAA)","2015-09-30"]
[1023239,"SC056812",334,"Solihull","LA","2003-10-27"]
[1023244,"SC056858",933,"Somerset","LA","2003-10-28"]
[1023245,"SC056860",803,"South Gloucestershire","LA","2003-10-28"]
[1022956,"SC050051",393,"South Tyneside","LA","2003-07-15"]
[1023246,"SC056862",852,"Southampton","LA","2003-10-28"]
[1023289,"SC057823",882,"Southend-on-Sea","LA","2003-11-17"]
[1023247,"SC056870",210,"Southwark","LA","2003-10-28"]
[1023248,"SC056872",342,"St Helens","LA","2003-10-28"]
[1023105,"SC054164",860,"Staffordshire","LA","2003-09-10"]
[1023250,"SC056877",356,"Stockport","LA","2003-10-28"]
[1023249,"SC056876",808,"Stockton-on-Tees","LA","2003-10-28"]
[1023351,"SC059591",861,"Stoke-on-Trent","LA","2004-01-19"]
[1023288,"SC057814",935,"Suffolk","LA","2003-11-17"]
[1254834,1254834,394,"Sunderland","LA (VAA)","2017-03-31"]
[1254834,"SC056878",394,"Sunderland","LA","2003-10-28","2017-03-30"]
[1023242,"SC056851",936,"Surrey","LA","2003-10-28"]
[1023103,"SC054069",319,"Sutton","LA","2003-09-09"]
[1023252,"SC056881",866,"Swindon","LA","2003-10-28"]
[1023104,"SC054157",357,"Tameside","LA","2003-09-10"]
[1026017,"SC454367",894,"Telford and Wrekin","LA","2012-08-24"]
[1023259,"SC057173",883,"Thurrock","LA","2003-11-03"]
[1023260,"SC057174",880,"Torbay","LA","2003-11-03"]
[1023487,"SC061617",211,"Tower Hamlets","LA","2004-06-02"]
[1023261,"SC057183",358,"Trafford","LA","2003-11-03"]
[1022947,"SC050034","205T","Tri-Borough","LA","2011-06-01","2019-09-30"]
[1023258,"SC057171",384,"Wakefield","LA","2003-11-03"]
["xxWALE","xxWALE",null,"Wales","LA outside England"]
[1023264,"SC057237",335,"Walsall","LA","2003-11-04"]
[1023175,"SC055898",320,"Waltham Forest","LA","2003-10-09"]
[1023297,"SC058212",212,"Wandsworth","LA","2003-11-24"]
[1022955,"SC050050",877,"Warrington","LA","2003-07-15"]
[1023106,"SC054166",937,"Warwickshire","LA","2003-09-10"]
[1023265,"SC057256",869,"West Berkshire","LA","2003-11-04"]
[1022961,"SC050067",938,"West Sussex","LA","2003-07-15"]
[1022947,"SC050034",213,"Westminster","LA","1990-01-01","2011-05-31"]
[2733383,2733383,null,"Westmoreland and Furness","LA","2023-04-01"]
[1023267,"SC057269",359,"Wigan","LA","2003-11-04"]
[1022958,"SC050059",865,"Wiltshire","LA","2003-07-15"]
[1023271,"SC057310",868,"Windsor and Maidenhead","LA","2003-11-05"]
[1023382,"SC059886",344,"Wirral","LA","2004-02-03"]
[1022959,"SC050063",872,"Wokingham","LA","2003-07-15"]
[1023298,"SC058214",336,"Wolverhampton","LA","2003-11-24"]
[1023272,"SC057349",885,"Worcestershire","LA","2003-11-05"]
[1022960,"SC050064",816,"York","LA","2003-07-15"]

{"sheet":"Analysis","index":7,"n_rows":110,"n_cols":50,"rows_kept":110,"cut":false,"hidden":false,"merged":[]}
["Quarter",{"$f":"Instructions!H5","v":"2025/26 Q4"},{"$f":"Instructions!F7","v":0},"v4"]
["Report date",{"$f":"INDEX(Lists!$R$2:$R$49,MATCH(B1,Qtrs,0))","v":"2026-03-31"},{"$f":"EDATE(RDate,-36)+1","v":"2023-04-01"},{"$f":"INDEX(Lists!$P$2:$P$31,MATCH(E2,Lists!$P$2:$P$31,0)-1)","v":"2022/23"},{"$f":"INDEX(Lists!$P$2:$P$31,MATCH(F2,Lists!$P$2:$P$31,0)-1)","v":"2023/24"},{"$f":"INDEX(Lists!$P$2:$P$31,MATCH(G2,Lists!$P$2:$P$31,0)-1)","v":"2024/25"},{"$f":"VLOOKUP(RDate,Lists!$O$2:$P$31,2)","v":"2025/26"}]
["Agency",{"$f":"INDEX(Lists!$N$2:$N$62,MATCH(C1,Agencies,0),1)","v":{"$error":"#N/A"}}]
[]
[]
["MONTHLY",{"$f":"DATE(IF(MONTH(RDate)=3,YEAR(RDate)-4,YEAR(RDate)-3),4,1)","v":"2022-04-01"},{"$f":"EDATE(B6,1)","v":"2022-05-01"},{"$f":"EDATE(C6,1)","v":"2022-06-01"},"2022-07-01","2022-08-01","2022-09-01","2022-10-01","2022-11-01","2022-12-01","2023-01-01","2023-02-01",{"$f":"EDATE(L6,1)","v":"2023-03-01"},"2023-04-01","2023-05-01","2023-06-01","2023-07-01","2023-08-01","2023-09-01","2023-10-01",{"$f":"EDATE(T6,1)","v":"2023-11-01"},"2023-12-01","2024-01-01","2024-02-01","2024-03-01","2024-04-01","2024-05-01","2024-06-01","2024-07-01","2024-08-01",{"$f":"EDATE(AD6,1)","v":"2024-09-01"},"2024-10-01","2024-11-01","2024-12-01","2025-01-01","2025-02-01","2025-03-01","2025-04-01","2025-05-01","2025-06-01",{"$f":"EDATE(AN6,1)","v":"2025-07-01"},"2025-08-01","2025-09-01","2025-10-01","2025-11-01","2025-12-01","2026-01-01","2026-02-01",{"$f":"EDATE(AV6,1)","v":"2026-03-01"},{"$f":"EDATE(AW6,1)","v":"2026-04-01"}]
["AO",{"$f":"COUNTIFS(Data!$U$3:$U$99780,\">=\"&B$6,Data!$U$3:$U$99780,\"<\"&C$6,Data!$AE$3:$AE$99780,TRUE)","v":0},{"$f":"COUNTIFS(Data!$U$3:$U$99780,\">=\"&C$6,Data!$U$3:$U$99780,\"<\"&D$6,Data!$AE$3:$AE$99780,TRUE)","v":0},{"$f":"COUNTIFS(Data!$U$3:$U$99780,\">=\"&D$6,Data!$U$3:$U$99780,\"<\"&E$6,Data!$AE$3:$AE$99780,TRUE)","v":0},{"$f":"COUNTIFS(Data!$U$3:$U$99780,\">=\"&E$6,Data!$U$3:$U$99780,\"<\"&F$6,Data!$AE$3:$AE$99780,TRUE)","v":0},{"$f":"COUNTIFS(Data!$U$3:$U$99780,\">=\"&F$6,Data!$U$3:$U$99780,\"<\"&G$6,Data!$AE$3:$AE$99780,TRUE)","v":0},{"$f":"COUNTIFS(Data!$U$3:$U$99780,\">=\"&G$6,Data!$U$3:$U$99780,\"<\"&H$6,Data!$AE$3:$AE$99780,TRUE)","v":0},{"$f":"COUNTIFS(Data!$U$3:$U$99780,\">=\"&H$6,Data!$U$3:$U$99780,\"<\"&I$6,Data!$AE$3:$AE$99780,TRUE)","v":0},{"$f":"COUNTIFS(Data!$U$3:$U$99780,\">=\"&I$6,Data!$U$3:$U$99780,\"<\"&J$6,Data!$AE$3:$AE$99780,TRUE)","v":0},{"$f":"COUNTIFS(Data!$U$3:$U$99780,\">=\"&J$6,Data!$U$3:$U$99780,\"<\"&K$6,Data!$AE$3:$AE$99780,TRUE)","v":0},{"$f":"COUNTIFS(Data!$U$3:$U$99780,\">=\"&K$6,Data!$U$3:$U$99780,\"<\"&L$6,Data!$AE$3:$AE$99780,TRUE)","v":0},{"$f":"COUNTIFS(Data!$U$3:$U$99780,\">=\"&L$6,Data!$U$3:$U$99780,\"<\"&M$6,Data!$AE$3:$AE$99780,TRUE)","v":0},{"$f":"COUNTIFS(Data!$U$3:$U$99780,\">=\"&M$6,Data!$U$3:$U$99780,\"<\"&N$6,Data!$AE$3:$AE$99780,TRUE)","v":0},{"$f":"COUNTIFS(Data!$U$3:$U$99780,\">=\"&N$6,Data!$U$3:$U$99780,\"<\"&O$6,Data!$AE$3:$AE$99780,TRUE)","v":0},{"$f":"COUNTIFS(Data!$U$3:$U$99780,\">=\"&O$6,Data!$U$3:$U$99780,\"<\"&P$6,Data!$AE$3:$AE$99780,TRUE)","v":0},{"$f":"COUNTIFS(Data!$U$3:$U$99780,\">=\"&P$6,Data!$U$3:$U$99780,\"<\"&Q$6,Data!$AE$3:$AE$99780,TRUE)","v":0},{"$f":"COUNTIFS(Data!$U$3:$U$99780,\">=\"&Q$6,Data!$U$3:$U$99780,\"<\"&R$6,Data!$AE$3:$AE$99780,TRUE)","v":0},{"$f":"COUNTIFS(Data!$U$3:$U$99780,\">=\"&R$6,Data!$U$3:$U$99780,\"<\"&S$6,Data!$AE$3:$AE$99780,TRUE)","v":0},{"$f":"COUNTIFS(Data!$U$3:$U$99780,\">=\"&S$6,Data!$U$3:$U$99780,\"<\"&T$6,Data!$AE$3:$AE$99780,TRUE)","v":0},{"$f":"COUNTIFS(Data!$U$3:$U$99780,\">=\"&T$6,Data!$U$3:$U$99780,\"<\"&U$6,Data!$AE$3:$AE$99780,TRUE)","v":0},{"$f":"COUNTIFS(Data!$U$3:$U$99780,\">=\"&U$6,Data!$U$3:$U$99780,\"<\"&V$6,Data!$AE$3:$AE$99780,TRUE)","v":0},{"$f":"COUNTIFS(Data!$U$3:$U$99780,\">=\"&V$6,Data!$U$3:$U$99780,\"<\"&W$6,Data!$AE$3:$AE$99780,TRUE)","v":0},{"$f":"COUNTIFS(Data!$U$3:$U$99780,\">=\"&W$6,Data!$U$3:$U$99780,\"<\"&X$6,Data!$AE$3:$AE$99780,TRUE)","v":0},{"$f":"COUNTIFS(Data!$U$3:$U$99780,\">=\"&X$6,Data!$U$3:$U$99780,\"<\"&Y$6,Data!$AE$3:$AE$99780,TRUE)","v":0},{"$f":"COUNTIFS(Data!$U$3:$U$99780,\">=\"&Y$6,Data!$U$3:$U$99780,\"<\"&Z$6,Data!$AE$3:$AE$99780,TRUE)","v":0},{"$f":"COUNTIFS(Data!$U$3:$U$99780,\">=\"&Z$6,Data!$U$3:$U$99780,\"<\"&AA$6,Data!$AE$3:$AE$99780,TRUE)","v":0},{"$f":"COUNTIFS(Data!$U$3:$U$99780,\">=\"&AA$6,Data!$U$3:$U$99780,\"<\"&AB$6,Data!$AE$3:$AE$99780,TRUE)","v":0},{"$f":"COUNTIFS(Data!$U$3:$U$99780,\">=\"&AB$6,Data!$U$3:$U$99780,\"<\"&AC$6,Data!$AE$3:$AE$99780,TRUE)","v":0},{"$f":"COUNTIFS(Data!$U$3:$U$99780,\">=\"&AC$6,Data!$U$3:$U$99780,\"<\"&AD$6,Data!$AE$3:$AE$99780,TRUE)","v":0},{"$f":"COUNTIFS(Data!$U$3:$U$99780,\">=\"&AD$6,Data!$U$3:$U$99780,\"<\"&AE$6,Data!$AE$3:$AE$99780,TRUE)","v":0},{"$f":"COUNTIFS(Data!$U$3:$U$99780,\">=\"&AE$6,Data!$U$3:$U$99780,\"<\"&AF$6,Data!$AE$3:$AE$99780,TRUE)","v":0},{"$f":"COUNTIFS(Data!$U$3:$U$99780,\">=\"&AF$6,Data!$U$3:$U$99780,\"<\"&AG$6,Data!$AE$3:$AE$99780,TRUE)","v":0},{"$f":"COUNTIFS(Data!$U$3:$U$99780,\">=\"&AG$6,Data!$U$3:$U$99780,\"<\"&AH$6,Data!$AE$3:$AE$99780,TRUE)","v":0},{"$f":"COUNTIFS(Data!$U$3:$U$99780,\">=\"&AH$6,Data!$U$3:$U$99780,\"<\"&AI$6,Data!$AE$3:$AE$99780,TRUE)","v":0},{"$f":"COUNTIFS(Data!$U$3:$U$99780,\">=\"&AI$6,Data!$U$3:$U$99780,\"<\"&AJ$6,Data!$AE$3:$AE$99780,TRUE)","v":0},{"$f":"COUNTIFS(Data!$U$3:$U$99780,\">=\"&AJ$6,Data!$U$3:$U$99780,\"<\"&AK$6,Data!$AE$3:$AE$99780,TRUE)","v":0},{"$f":"COUNTIFS(Data!$U$3:$U$99780,\">=\"&AK$6,Data!$U$3:$U$99780,\"<\"&AL$6,Data!$AE$3:$AE$99780,TRUE)","v":0},{"$f":"COUNTIFS(Data!$U$3:$U$99780,\">=\"&AL$6,Data!$U$3:$U$99780,\"<\"&AM$6,Data!$AE$3:$AE$99780,TRUE)","v":0},{"$f":"COUNTIFS(Data!$U$3:$U$99780,\">=\"&AM$6,Data!$U$3:$U$99780,\"<\"&AN$6,Data!$AE$3:$AE$99780,TRUE)","v":0},{"$f":"COUNTIFS(Data!$U$3:$U$99780,\">=\"&AN$6,Data!$U$3:$U$99780,\"<\"&AO$6,Data!$AE$3:$AE$99780,TRUE)","v":0},{"$f":"COUNTIFS(Data!$U$3:$U$99780,\">=\"&AO$6,Data!$U$3:$U$99780,\"<\"&AP$6,Data!$AE$3:$AE$99780,TRUE)","v":0},{"$f":"COUNTIFS(Data!$U$3:$U$99780,\">=\"&AP$6,Data!$U$3:$U$99780,\"<\"&AQ$6,Data!$AE$3:$AE$99780,TRUE)","v":0},{"$f":"COUNTIFS(Data!$U$3:$U$99780,\">=\"&AQ$6,Data!$U$3:$U$99780,\"<\"&AR$6,Data!$AE$3:$AE$99780,TRUE)","v":0},{"$f":"COUNTIFS(Data!$U$3:$U$99780,\">=\"&AR$6,Data!$U$3:$U$99780,\"<\"&AS$6,Data!$AE$3:$AE$99780,TRUE)","v":0},{"$f":"COUNTIFS(Data!$U$3:$U$99780,\">=\"&AS$6,Data!$U$3:$U$99780,\"<\"&AT$6,Data!$AE$3:$AE$99780,TRUE)","v":0},{"$f":"COUNTIFS(Data!$U$3:$U$99780,\">=\"&AT$6,Data!$U$3:$U$99780,\"<\"&AU$6,Data!$AE$3:$AE$99780,TRUE)","v":0},{"$f":"COUNTIFS(Data!$U$3:$U$99780,\">=\"&AU$6,Data!$U$3:$U$99780,\"<\"&AV$6,Data!$AE$3:$AE$99780,TRUE)","v":0},{"$f":"COUNTIFS(Data!$U$3:$U$99780,\">=\"&AV$6,Data!$U$3:$U$99780,\"<\"&AW$6,Data!$AE$3:$AE$99780,TRUE)","v":0},{"$f":"COUNTIFS(Data!$U$3:$U$99780,\">=\"&AW$6,Data!$U$3:$U$99780,\"<\"&AX$6,Data!$AE$3:$AE$99780,TRUE)","v":0}]
["Placement",{"$f":"COUNTIFS(Data!$S$3:$S$99780,\">=\"&B$6,Data!$S$3:$S$99780,\"<\"&C$6,Data!$AE$3:$AE$99780,TRUE)","v":0},{"$f":"COUNTIFS(Data!$S$3:$S$99780,\">=\"&C$6,Data!$S$3:$S$99780,\"<\"&D$6,Data!$AE$3:$AE$99780,TRUE)","v":0},{"$f":"COUNTIFS(Data!$S$3:$S$99780,\">=\"&D$6,Data!$S$3:$S$99780,\"<\"&E$6,Data!$AE$3:$AE$99780,TRUE)","v":0},{"$f":"COUNTIFS(Data!$S$3:$S$99780,\">=\"&E$6,Data!$S$3:$S$99780,\"<\"&F$6,Data!$AE$3:$AE$99780,TRUE)","v":0},{"$f":"COUNTIFS(Data!$S$3:$S$99780,\">=\"&F$6,Data!$S$3:$S$99780,\"<\"&G$6,Data!$AE$3:$AE$99780,TRUE)","v":0},{"$f":"COUNTIFS(Data!$S$3:$S$99780,\">=\"&G$6,Data!$S$3:$S$99780,\"<\"&H$6,Data!$AE$3:$AE$99780,TRUE)","v":0},{"$f":"COUNTIFS(Data!$S$3:$S$99780,\">=\"&H$6,Data!$S$3:$S$99780,\"<\"&I$6,Data!$AE$3:$AE$99780,TRUE)","v":0},{"$f":"COUNTIFS(Data!$S$3:$S$99780,\">=\"&I$6,Data!$S$3:$S$99780,\"<\"&J$6,Data!$AE$3:$AE$99780,TRUE)","v":0},{"$f":"COUNTIFS(Data!$S$3:$S$99780,\">=\"&J$6,Data!$S$3:$S$99780,\"<\"&K$6,Data!$AE$3:$AE$99780,TRUE)","v":0},{"$f":"COUNTIFS(Data!$S$3:$S$99780,\">=\"&K$6,Data!$S$3:$S$99780,\"<\"&L$6,Data!$AE$3:$AE$99780,TRUE)","v":0},{"$f":"COUNTIFS(Data!$S$3:$S$99780,\">=\"&L$6,Data!$S$3:$S$99780,\"<\"&M$6,Data!$AE$3:$AE$99780,TRUE)","v":0},{"$f":"COUNTIFS(Data!$S$3:$S$99780,\">=\"&M$6,Data!$S$3:$S$99780,\"<\"&N$6,Data!$AE$3:$AE$99780,TRUE)","v":0},{"$f":"COUNTIFS(Data!$S$3:$S$99780,\">=\"&N$6,Data!$S$3:$S$99780,\"<\"&O$6,Data!$AE$3:$AE$99780,TRUE)","v":0},{"$f":"COUNTIFS(Data!$S$3:$S$99780,\">=\"&O$6,Data!$S$3:$S$99780,\"<\"&P$6,Data!$AE$3:$AE$99780,TRUE)","v":0},{"$f":"COUNTIFS(Data!$S$3:$S$99780,\">=\"&P$6,Data!$S$3:$S$99780,\"<\"&Q$6,Data!$AE$3:$AE$99780,TRUE)","v":0},{"$f":"COUNTIFS(Data!$S$3:$S$99780,\">=\"&Q$6,Data!$S$3:$S$99780,\"<\"&R$6,Data!$AE$3:$AE$99780,TRUE)","v":0},{"$f":"COUNTIFS(Data!$S$3:$S$99780,\">=\"&R$6,Data!$S$3:$S$99780,\"<\"&S$6,Data!$AE$3:$AE$99780,TRUE)","v":0},{"$f":"COUNTIFS(Data!$S$3:$S$99780,\">=\"&S$6,Data!$S$3:$S$99780,\"<\"&T$6,Data!$AE$3:$AE$99780,TRUE)","v":0},{"$f":"COUNTIFS(Data!$S$3:$S$99780,\">=\"&T$6,Data!$S$3:$S$99780,\"<\"&U$6,Data!$AE$3:$AE$99780,TRUE)","v":0},{"$f":"COUNTIFS(Data!$S$3:$S$99780,\">=\"&U$6,Data!$S$3:$S$99780,\"<\"&V$6,Data!$AE$3:$AE$99780,TRUE)","v":0},{"$f":"COUNTIFS(Data!$S$3:$S$99780,\">=\"&V$6,Data!$S$3:$S$99780,\"<\"&W$6,Data!$AE$3:$AE$99780,TRUE)","v":0},{"$f":"COUNTIFS(Data!$S$3:$S$99780,\">=\"&W$6,Data!$S$3:$S$99780,\"<\"&X$6,Data!$AE$3:$AE$99780,TRUE)","v":0},{"$f":"COUNTIFS(Data!$S$3:$S$99780,\">=\"&X$6,Data!$S$3:$S$99780,\"<\"&Y$6,Data!$AE$3:$AE$99780,TRUE)","v":0},{"$f":"COUNTIFS(Data!$S$3:$S$99780,\">=\"&Y$6,Data!$S$3:$S$99780,\"<\"&Z$6,Data!$AE$3:$AE$99780,TRUE)","v":0},{"$f":"COUNTIFS(Data!$S$3:$S$99780,\">=\"&Z$6,Data!$S$3:$S$99780,\"<\"&AA$6,Data!$AE$3:$AE$99780,TRUE)","v":0},{"$f":"COUNTIFS(Data!$S$3:$S$99780,\">=\"&AA$6,Data!$S$3:$S$99780,\"<\"&AB$6,Data!$AE$3:$AE$99780,TRUE)","v":0},{"$f":"COUNTIFS(Data!$S$3:$S$99780,\">=\"&AB$6,Data!$S$3:$S$99780,\"<\"&AC$6,Data!$AE$3:$AE$99780,TRUE)","v":0},{"$f":"COUNTIFS(Data!$S$3:$S$99780,\">=\"&AC$6,Data!$S$3:$S$99780,\"<\"&AD$6,Data!$AE$3:$AE$99780,TRUE)","v":0},{"$f":"COUNTIFS(Data!$S$3:$S$99780,\">=\"&AD$6,Data!$S$3:$S$99780,\"<\"&AE$6,Data!$AE$3:$AE$99780,TRUE)","v":0},{"$f":"COUNTIFS(Data!$S$3:$S$99780,\">=\"&AE$6,Data!$S$3:$S$99780,\"<\"&AF$6,Data!$AE$3:$AE$99780,TRUE)","v":0},{"$f":"COUNTIFS(Data!$S$3:$S$99780,\">=\"&AF$6,Data!$S$3:$S$99780,\"<\"&AG$6,Data!$AE$3:$AE$99780,TRUE)","v":0},{"$f":"COUNTIFS(Data!$S$3:$S$99780,\">=\"&AG$6,Data!$S$3:$S$99780,\"<\"&AH$6,Data!$AE$3:$AE$99780,TRUE)","v":0},{"$f":"COUNTIFS(Data!$S$3:$S$99780,\">=\"&AH$6,Data!$S$3:$S$99780,\"<\"&AI$6,Data!$AE$3:$AE$99780,TRUE)","v":0},{"$f":"COUNTIFS(Data!$S$3:$S$99780,\">=\"&AI$6,Data!$S$3:$S$99780,\"<\"&AJ$6,Data!$AE$3:$AE$99780,TRUE)","v":0},{"$f":"COUNTIFS(Data!$S$3:$S$99780,\">=\"&AJ$6,Data!$S$3:$S$99780,\"<\"&AK$6,Data!$AE$3:$AE$99780,TRUE)","v":0},{"$f":"COUNTIFS(Data!$S$3:$S$99780,\">=\"&AK$6,Data!$S$3:$S$99780,\"<\"&AL$6,Data!$AE$3:$AE$99780,TRUE)","v":0},{"$f":"COUNTIFS(Data!$S$3:$S$99780,\">=\"&AL$6,Data!$S$3:$S$99780,\"<\"&AM$6,Data!$AE$3:$AE$99780,TRUE)","v":0},{"$f":"COUNTIFS(Data!$S$3:$S$99780,\">=\"&AM$6,Data!$S$3:$S$99780,\"<\"&AN$6,Data!$AE$3:$AE$99780,TRUE)","v":0},{"$f":"COUNTIFS(Data!$S$3:$S$99780,\">=\"&AN$6,Data!$S$3:$S$99780,\"<\"&AO$6,Data!$AE$3:$AE$99780,TRUE)","v":0},{"$f":"COUNTIFS(Data!$S$3:$S$99780,\">=\"&AO$6,Data!$S$3:$S$99780,\"<\"&AP$6,Data!$AE$3:$AE$99780,TRUE)","v":0},{"$f":"COUNTIFS(Data!$S$3:$S$99780,\">=\"&AP$6,Data!$S$3:$S$99780,\"<\"&AQ$6,Data!$AE$3:$AE$99780,TRUE)","v":0},{"$f":"COUNTIFS(Data!$S$3:$S$99780,\">=\"&AQ$6,Data!$S$3:$S$99780,\"<\"&AR$6,Data!$AE$3:$AE$99780,TRUE)","v":0},{"$f":"COUNTIFS(Data!$S$3:$S$99780,\">=\"&AR$6,Data!$S$3:$S$99780,\"<\"&AS$6,Data!$AE$3:$AE$99780,TRUE)","v":0},{"$f":"COUNTIFS(Data!$S$3:$S$99780,\">=\"&AS$6,Data!$S$3:$S$99780,\"<\"&AT$6,Data!$AE$3:$AE$99780,TRUE)","v":0},{"$f":"COUNTIFS(Data!$S$3:$S$99780,\">=\"&AT$6,Data!$S$3:$S$99780,\"<\"&AU$6,Data!$AE$3:$AE$99780,TRUE)","v":0},{"$f":"COUNTIFS(Data!$S$3:$S$99780,\">=\"&AU$6,Data!$S$3:$S$99780,\"<\"&AV$6,Data!$AE$3:$AE$99780,TRUE)","v":0},{"$f":"COUNTIFS(Data!$S$3:$S$99780,\">=\"&AV$6,Data!$S$3:$S$99780,\"<\"&AW$6,Data!$AE$3:$AE$99780,TRUE)","v":0},{"$f":"COUNTIFS(Data!$S$3:$S$99780,\">=\"&AW$6,Data!$S$3:$S$99780,\"<\"&AX$6,Data!$AE$3:$AE$99780,TRUE)","v":0}]
["Matches",{"$f":"COUNTIFS(Data!$R$3:$R$99780,\">=\"&B$6,Data!$R$3:$R$99780,\"<\"&C$6,Data!$AE$3:$AE$99780,TRUE)","v":0},{"$f":"COUNTIFS(Data!$R$3:$R$99780,\">=\"&C$6,Data!$R$3:$R$99780,\"<\"&D$6,Data!$AE$3:$AE$99780,TRUE)","v":0},{"$f":"COUNTIFS(Data!$R$3:$R$99780,\">=\"&D$6,Data!$R$3:$R$99780,\"<\"&E$6,Data!$AE$3:$AE$99780,TRUE)","v":0},{"$f":"COUNTIFS(Data!$R$3:$R$99780,\">=\"&E$6,Data!$R$3:$R$99780,\"<\"&F$6,Data!$AE$3:$AE$99780,TRUE)","v":0},{"$f":"COUNTIFS(Data!$R$3:$R$99780,\">=\"&F$6,Data!$R$3:$R$99780,\"<\"&G$6,Data!$AE$3:$AE$99780,TRUE)","v":0},{"$f":"COUNTIFS(Data!$R$3:$R$99780,\">=\"&G$6,Data!$R$3:$R$99780,\"<\"&H$6,Data!$AE$3:$AE$99780,TRUE)","v":0},{"$f":"COUNTIFS(Data!$R$3:$R$99780,\">=\"&H$6,Data!$R$3:$R$99780,\"<\"&I$6,Data!$AE$3:$AE$99780,TRUE)","v":0},{"$f":"COUNTIFS(Data!$R$3:$R$99780,\">=\"&I$6,Data!$R$3:$R$99780,\"<\"&J$6,Data!$AE$3:$AE$99780,TRUE)","v":0},{"$f":"COUNTIFS(Data!$R$3:$R$99780,\">=\"&J$6,Data!$R$3:$R$99780,\"<\"&K$6,Data!$AE$3:$AE$99780,TRUE)","v":0},{"$f":"COUNTIFS(Data!$R$3:$R$99780,\">=\"&K$6,Data!$R$3:$R$99780,\"<\"&L$6,Data!$AE$3:$AE$99780,TRUE)","v":0},{"$f":"COUNTIFS(Data!$R$3:$R$99780,\">=\"&L$6,Data!$R$3:$R$99780,\"<\"&M$6,Data!$AE$3:$AE$99780,TRUE)","v":0},{"$f":"COUNTIFS(Data!$R$3:$R$99780,\">=\"&M$6,Data!$R$3:$R$99780,\"<\"&N$6,Data!$AE$3:$AE$99780,TRUE)","v":0},{"$f":"COUNTIFS(Data!$R$3:$R$99780,\">=\"&N$6,Data!$R$3:$R$99780,\"<\"&O$6,Data!$AE$3:$AE$99780,TRUE)","v":0},{"$f":"COUNTIFS(Data!$R$3:$R$99780,\">=\"&O$6,Data!$R$3:$R$99780,\"<\"&P$6,Data!$AE$3:$AE$99780,TRUE)","v":0},{"$f":"COUNTIFS(Data!$R$3:$R$99780,\">=\"&P$6,Data!$R$3:$R$99780,\"<\"&Q$6,Data!$AE$3:$AE$99780,TRUE)","v":0},{"$f":"COUNTIFS(Data!$R$3:$R$99780,\">=\"&Q$6,Data!$R$3:$R$99780,\"<\"&R$6,Data!$AE$3:$AE$99780,TRUE)","v":0},{"$f":"COUNTIFS(Data!$R$3:$R$99780,\">=\"&R$6,Data!$R$3:$R$99780,\"<\"&S$6,Data!$AE$3:$AE$99780,TRUE)","v":0},{"$f":"COUNTIFS(Data!$R$3:$R$99780,\">=\"&S$6,Data!$R$3:$R$99780,\"<\"&T$6,Data!$AE$3:$AE$99780,TRUE)","v":0},{"$f":"COUNTIFS(Data!$R$3:$R$99780,\">=\"&T$6,Data!$R$3:$R$99780,\"<\"&U$6,Data!$AE$3:$AE$99780,TRUE)","v":0},{"$f":"COUNTIFS(Data!$R$3:$R$99780,\">=\"&U$6,Data!$R$3:$R$99780,\"<\"&V$6,Data!$AE$3:$AE$99780,TRUE)","v":0},{"$f":"COUNTIFS(Data!$R$3:$R$99780,\">=\"&V$6,Data!$R$3:$R$99780,\"<\"&W$6,Data!$AE$3:$AE$99780,TRUE)","v":0},{"$f":"COUNTIFS(Data!$R$3:$R$99780,\">=\"&W$6,Data!$R$3:$R$99780,\"<\"&X$6,Data!$AE$3:$AE$99780,TRUE)","v":0},{"$f":"COUNTIFS(Data!$R$3:$R$99780,\">=\"&X$6,Data!$R$3:$R$99780,\"<\"&Y$6,Data!$AE$3:$AE$99780,TRUE)","v":0},{"$f":"COUNTIFS(Data!$R$3:$R$99780,\">=\"&Y$6,Data!$R$3:$R$99780,\"<\"&Z$6,Data!$AE$3:$AE$99780,TRUE)","v":0},{"$f":"COUNTIFS(Data!$R$3:$R$99780,\">=\"&Z$6,Data!$R$3:$R$99780,\"<\"&AA$6,Data!$AE$3:$AE$99780,TRUE)","v":0},{"$f":"COUNTIFS(Data!$R$3:$R$99780,\">=\"&AA$6,Data!$R$3:$R$99780,\"<\"&AB$6,Data!$AE$3:$AE$99780,TRUE)","v":0},{"$f":"COUNTIFS(Data!$R$3:$R$99780,\">=\"&AB$6,Data!$R$3:$R$99780,\"<\"&AC$6,Data!$AE$3:$AE$99780,TRUE)","v":0},{"$f":"COUNTIFS(Data!$R$3:$R$99780,\">=\"&AC$6,Data!$R$3:$R$99780,\"<\"&AD$6,Data!$AE$3:$AE$99780,TRUE)","v":0},{"$f":"COUNTIFS(Data!$R$3:$R$99780,\">=\"&AD$6,Data!$R$3:$R$99780,\"<\"&AE$6,Data!$AE$3:$AE$99780,TRUE)","v":0},{"$f":"COUNTIFS(Data!$R$3:$R$99780,\">=\"&AE$6,Data!$R$3:$R$99780,\"<\"&AF$6,Data!$AE$3:$AE$99780,TRUE)","v":0},{"$f":"COUNTIFS(Data!$R$3:$R$99780,\">=\"&AF$6,Data!$R$3:$R$99780,\"<\"&AG$6,Data!$AE$3:$AE$99780,TRUE)","v":0},{"$f":"COUNTIFS(Data!$R$3:$R$99780,\">=\"&AG$6,Data!$R$3:$R$99780,\"<\"&AH$6,Data!$AE$3:$AE$99780,TRUE)","v":0},{"$f":"COUNTIFS(Data!$R$3:$R$99780,\">=\"&AH$6,Data!$R$3:$R$99780,\"<\"&AI$6,Data!$AE$3:$AE$99780,TRUE)","v":0},{"$f":"COUNTIFS(Data!$R$3:$R$99780,\">=\"&AI$6,Data!$R$3:$R$99780,\"<\"&AJ$6,Data!$AE$3:$AE$99780,TRUE)","v":0},{"$f":"COUNTIFS(Data!$R$3:$R$99780,\">=\"&AJ$6,Data!$R$3:$R$99780,\"<\"&AK$6,Data!$AE$3:$AE$99780,TRUE)","v":0},{"$f":"COUNTIFS(Data!$R$3:$R$99780,\">=\"&AK$6,Data!$R$3:$R$99780,\"<\"&AL$6,Data!$AE$3:$AE$99780,TRUE)","v":0},{"$f":"COUNTIFS(Data!$R$3:$R$99780,\">=\"&AL$6,Data!$R$3:$R$99780,\"<\"&AM$6,Data!$AE$3:$AE$99780,TRUE)","v":0},{"$f":"COUNTIFS(Data!$R$3:$R$99780,\">=\"&AM$6,Data!$R$3:$R$99780,\"<\"&AN$6,Data!$AE$3:$AE$99780,TRUE)","v":0},{"$f":"COUNTIFS(Data!$R$3:$R$99780,\">=\"&AN$6,Data!$R$3:$R$99780,\"<\"&AO$6,Data!$AE$3:$AE$99780,TRUE)","v":0},{"$f":"COUNTIFS(Data!$R$3:$R$99780,\">=\"&AO$6,Data!$R$3:$R$99780,\"<\"&AP$6,Data!$AE$3:$AE$99780,TRUE)","v":0},{"$f":"COUNTIFS(Data!$R$3:$R$99780,\">=\"&AP$6,Data!$R$3:$R$99780,\"<\"&AQ$6,Data!$AE$3:$AE$99780,TRUE)","v":0},{"$f":"COUNTIFS(Data!$R$3:$R$99780,\">=\"&AQ$6,Data!$R$3:$R$99780,\"<\"&AR$6,Data!$AE$3:$AE$99780,TRUE)","v":0},{"$f":"COUNTIFS(Data!$R$3:$R$99780,\">=\"&AR$6,Data!$R$3:$R$99780,\"<\"&AS$6,Data!$AE$3:$AE$99780,TRUE)","v":0},{"$f":"COUNTIFS(Data!$R$3:$R$99780,\">=\"&AS$6,Data!$R$3:$R$99780,\"<\"&AT$6,Data!$AE$3:$AE$99780,TRUE)","v":0},{"$f":"COUNTIFS(Data!$R$3:$R$99780,\">=\"&AT$6,Data!$R$3:$R$99780,\"<\"&AU$6,Data!$AE$3:$AE$99780,TRUE)","v":0},{"$f":"COUNTIFS(Data!$R$3:$R$99780,\">=\"&AU$6,Data!$R$3:$R$99780,\"<\"&AV$6,Data!$AE$3:$AE$99780,TRUE)","v":0},{"$f":"COUNTIFS(Data!$R$3:$R$99780,\">=\"&AV$6,Data!$R$3:$R$99780,\"<\"&AW$6,Data!$AE$3:$AE$99780,TRUE)","v":0},{"$f":"COUNTIFS(Data!$R$3:$R$99780,\">=\"&AW$6,Data!$R$3:$R$99780,\"<\"&AX$6,Data!$AE$3:$AE$99780,TRUE)","v":0}]
["Approvals",{"$f":"COUNTIFS(Data!$Q$3:$Q$99780,\">=\"&B$6,Data!$Q$3:$Q$99780,\"<\"&C$6,Data!$AE$3:$AE$99780,TRUE)","v":0},{"$f":"COUNTIFS(Data!$Q$3:$Q$99780,\">=\"&C$6,Data!$Q$3:$Q$99780,\"<\"&D$6,Data!$AE$3:$AE$99780,TRUE)","v":0},{"$f":"COUNTIFS(Data!$Q$3:$Q$99780,\">=\"&D$6,Data!$Q$3:$Q$99780,\"<\"&E$6,Data!$AE$3:$AE$99780,TRUE)","v":0},{"$f":"COUNTIFS(Data!$Q$3:$Q$99780,\">=\"&E$6,Data!$Q$3:$Q$99780,\"<\"&F$6,Data!$AE$3:$AE$99780,TRUE)","v":0},{"$f":"COUNTIFS(Data!$Q$3:$Q$99780,\">=\"&F$6,Data!$Q$3:$Q$99780,\"<\"&G$6,Data!$AE$3:$AE$99780,TRUE)","v":0},{"$f":"COUNTIFS(Data!$Q$3:$Q$99780,\">=\"&G$6,Data!$Q$3:$Q$99780,\"<\"&H$6,Data!$AE$3:$AE$99780,TRUE)","v":0},{"$f":"COUNTIFS(Data!$Q$3:$Q$99780,\">=\"&H$6,Data!$Q$3:$Q$99780,\"<\"&I$6,Data!$AE$3:$AE$99780,TRUE)","v":0},{"$f":"COUNTIFS(Data!$Q$3:$Q$99780,\">=\"&I$6,Data!$Q$3:$Q$99780,\"<\"&J$6,Data!$AE$3:$AE$99780,TRUE)","v":0},{"$f":"COUNTIFS(Data!$Q$3:$Q$99780,\">=\"&J$6,Data!$Q$3:$Q$99780,\"<\"&K$6,Data!$AE$3:$AE$99780,TRUE)","v":0},{"$f":"COUNTIFS(Data!$Q$3:$Q$99780,\">=\"&K$6,Data!$Q$3:$Q$99780,\"<\"&L$6,Data!$AE$3:$AE$99780,TRUE)","v":0},{"$f":"COUNTIFS(Data!$Q$3:$Q$99780,\">=\"&L$6,Data!$Q$3:$Q$99780,\"<\"&M$6,Data!$AE$3:$AE$99780,TRUE)","v":0},{"$f":"COUNTIFS(Data!$Q$3:$Q$99780,\">=\"&M$6,Data!$Q$3:$Q$99780,\"<\"&N$6,Data!$AE$3:$AE$99780,TRUE)","v":0},{"$f":"COUNTIFS(Data!$Q$3:$Q$99780,\">=\"&N$6,Data!$Q$3:$Q$99780,\"<\"&O$6,Data!$AE$3:$AE$99780,TRUE)","v":0},{"$f":"COUNTIFS(Data!$Q$3:$Q$99780,\">=\"&O$6,Data!$Q$3:$Q$99780,\"<\"&P$6,Data!$AE$3:$AE$99780,TRUE)","v":0},{"$f":"COUNTIFS(Data!$Q$3:$Q$99780,\">=\"&P$6,Data!$Q$3:$Q$99780,\"<\"&Q$6,Data!$AE$3:$AE$99780,TRUE)","v":0},{"$f":"COUNTIFS(Data!$Q$3:$Q$99780,\">=\"&Q$6,Data!$Q$3:$Q$99780,\"<\"&R$6,Data!$AE$3:$AE$99780,TRUE)","v":0},{"$f":"COUNTIFS(Data!$Q$3:$Q$99780,\">=\"&R$6,Data!$Q$3:$Q$99780,\"<\"&S$6,Data!$AE$3:$AE$99780,TRUE)","v":0},{"$f":"COUNTIFS(Data!$Q$3:$Q$99780,\">=\"&S$6,Data!$Q$3:$Q$99780,\"<\"&T$6,Data!$AE$3:$AE$99780,TRUE)","v":0},{"$f":"COUNTIFS(Data!$Q$3:$Q$99780,\">=\"&T$6,Data!$Q$3:$Q$99780,\"<\"&U$6,Data!$AE$3:$AE$99780,TRUE)","v":0},{"$f":"COUNTIFS(Data!$Q$3:$Q$99780,\">=\"&U$6,Data!$Q$3:$Q$99780,\"<\"&V$6,Data!$AE$3:$AE$99780,TRUE)","v":0},{"$f":"COUNTIFS(Data!$Q$3:$Q$99780,\">=\"&V$6,Data!$Q$3:$Q$99780,\"<\"&W$6,Data!$AE$3:$AE$99780,TRUE)","v":0},{"$f":"COUNTIFS(Data!$Q$3:$Q$99780,\">=\"&W$6,Data!$Q$3:$Q$99780,\"<\"&X$6,Data!$AE$3:$AE$99780,TRUE)","v":0},{"$f":"COUNTIFS(Data!$Q$3:$Q$99780,\">=\"&X$6,Data!$Q$3:$Q$99780,\"<\"&Y$6,Data!$AE$3:$AE$99780,TRUE)","v":0},{"$f":"COUNTIFS(Data!$Q$3:$Q$99780,\">=\"&Y$6,Data!$Q$3:$Q$99780,\"<\"&Z$6,Data!$AE$3:$AE$99780,TRUE)","v":0},{"$f":"COUNTIFS(Data!$Q$3:$Q$99780,\">=\"&Z$6,Data!$Q$3:$Q$99780,\"<\"&AA$6,Data!$AE$3:$AE$99780,TRUE)","v":0},{"$f":"COUNTIFS(Data!$Q$3:$Q$99780,\">=\"&AA$6,Data!$Q$3:$Q$99780,\"<\"&AB$6,Data!$AE$3:$AE$99780,TRUE)","v":0},{"$f":"COUNTIFS(Data!$Q$3:$Q$99780,\">=\"&AB$6,Data!$Q$3:$Q$99780,\"<\"&AC$6,Data!$AE$3:$AE$99780,TRUE)","v":0},{"$f":"COUNTIFS(Data!$Q$3:$Q$99780,\">=\"&AC$6,Data!$Q$3:$Q$99780,\"<\"&AD$6,Data!$AE$3:$AE$99780,TRUE)","v":0},{"$f":"COUNTIFS(Data!$Q$3:$Q$99780,\">=\"&AD$6,Data!$Q$3:$Q$99780,\"<\"&AE$6,Data!$AE$3:$AE$99780,TRUE)","v":0},{"$f":"COUNTIFS(Data!$Q$3:$Q$99780,\">=\"&AE$6,Data!$Q$3:$Q$99780,\"<\"&AF$6,Data!$AE$3:$AE$99780,TRUE)","v":0},{"$f":"COUNTIFS(Data!$Q$3:$Q$99780,\">=\"&AF$6,Data!$Q$3:$Q$99780,\"<\"&AG$6,Data!$AE$3:$AE$99780,TRUE)","v":0},{"$f":"COUNTIFS(Data!$Q$3:$Q$99780,\">=\"&AG$6,Data!$Q$3:$Q$99780,\"<\"&AH$6,Data!$AE$3:$AE$99780,TRUE)","v":0},{"$f":"COUNTIFS(Data!$Q$3:$Q$99780,\">=\"&AH$6,Data!$Q$3:$Q$99780,\"<\"&AI$6,Data!$AE$3:$AE$99780,TRUE)","v":0},{"$f":"COUNTIFS(Data!$Q$3:$Q$99780,\">=\"&AI$6,Data!$Q$3:$Q$99780,\"<\"&AJ$6,Data!$AE$3:$AE$99780,TRUE)","v":0},{"$f":"COUNTIFS(Data!$Q$3:$Q$99780,\">=\"&AJ$6,Data!$Q$3:$Q$99780,\"<\"&AK$6,Data!$AE$3:$AE$99780,TRUE)","v":0},{"$f":"COUNTIFS(Data!$Q$3:$Q$99780,\">=\"&AK$6,Data!$Q$3:$Q$99780,\"<\"&AL$6,Data!$AE$3:$AE$99780,TRUE)","v":0},{"$f":"COUNTIFS(Data!$Q$3:$Q$99780,\">=\"&AL$6,Data!$Q$3:$Q$99780,\"<\"&AM$6,Data!$AE$3:$AE$99780,TRUE)","v":0},{"$f":"COUNTIFS(Data!$Q$3:$Q$99780,\">=\"&AM$6,Data!$Q$3:$Q$99780,\"<\"&AN$6,Data!$AE$3:$AE$99780,TRUE)","v":0},{"$f":"COUNTIFS(Data!$Q$3:$Q$99780,\">=\"&AN$6,Data!$Q$3:$Q$99780,\"<\"&AO$6,Data!$AE$3:$AE$99780,TRUE)","v":0},{"$f":"COUNTIFS(Data!$Q$3:$Q$99780,\">=\"&AO$6,Data!$Q$3:$Q$99780,\"<\"&AP$6,Data!$AE$3:$AE$99780,TRUE)","v":0},{"$f":"COUNTIFS(Data!$Q$3:$Q$99780,\">=\"&AP$6,Data!$Q$3:$Q$99780,\"<\"&AQ$6,Data!$AE$3:$AE$99780,TRUE)","v":0},{"$f":"COUNTIFS(Data!$Q$3:$Q$99780,\">=\"&AQ$6,Data!$Q$3:$Q$99780,\"<\"&AR$6,Data!$AE$3:$AE$99780,TRUE)","v":0},{"$f":"COUNTIFS(Data!$Q$3:$Q$99780,\">=\"&AR$6,Data!$Q$3:$Q$99780,\"<\"&AS$6,Data!$AE$3:$AE$99780,TRUE)","v":0},{"$f":"COUNTIFS(Data!$Q$3:$Q$99780,\">=\"&AS$6,Data!$Q$3:$Q$99780,\"<\"&AT$6,Data!$AE$3:$AE$99780,TRUE)","v":0},{"$f":"COUNTIFS(Data!$Q$3:$Q$99780,\">=\"&AT$6,Data!$Q$3:$Q$99780,\"<\"&AU$6,Data!$AE$3:$AE$99780,TRUE)","v":0},{"$f":"COUNTIFS(Data!$Q$3:$Q$99780,\">=\"&AU$6,Data!$Q$3:$Q$99780,\"<\"&AV$6,Data!$AE$3:$AE$99780,TRUE)","v":0},{"$f":"COUNTIFS(Data!$Q$3:$Q$99780,\">=\"&AV$6,Data!$Q$3:$Q$99780,\"<\"&AW$6,Data!$AE$3:$AE$99780,TRUE)","v":0},{"$f":"COUNTIFS(Data!$Q$3:$Q$99780,\">=\"&AW$6,Data!$Q$3:$Q$99780,\"<\"&AX$6,Data!$AE$3:$AE$99780,TRUE)","v":0}]
["S2 start",{"$f":"COUNTIFS(Data!$P$3:$P$99780,\">=\"&B$6,Data!$P$3:$P$99780,\"<\"&C$6,Data!$AE$3:$AE$99780,TRUE)","v":0},{"$f":"COUNTIFS(Data!$P$3:$P$99780,\">=\"&C$6,Data!$P$3:$P$99780,\"<\"&D$6,Data!$AE$3:$AE$99780,TRUE)","v":0},{"$f":"COUNTIFS(Data!$P$3:$P$99780,\">=\"&D$6,Data!$P$3:$P$99780,\"<\"&E$6,Data!$AE$3:$AE$99780,TRUE)","v":0},{"$f":"COUNTIFS(Data!$P$3:$P$99780,\">=\"&E$6,Data!$P$3:$P$99780,\"<\"&F$6,Data!$AE$3:$AE$99780,TRUE)","v":0},{"$f":"COUNTIFS(Data!$P$3:$P$99780,\">=\"&F$6,Data!$P$3:$P$99780,\"<\"&G$6,Data!$AE$3:$AE$99780,TRUE)","v":0},{"$f":"COUNTIFS(Data!$P$3:$P$99780,\">=\"&G$6,Data!$P$3:$P$99780,\"<\"&H$6,Data!$AE$3:$AE$99780,TRUE)","v":0},{"$f":"COUNTIFS(Data!$P$3:$P$99780,\">=\"&H$6,Data!$P$3:$P$99780,\"<\"&I$6,Data!$AE$3:$AE$99780,TRUE)","v":0},{"$f":"COUNTIFS(Data!$P$3:$P$99780,\">=\"&I$6,Data!$P$3:$P$99780,\"<\"&J$6,Data!$AE$3:$AE$99780,TRUE)","v":0},{"$f":"COUNTIFS(Data!$P$3:$P$99780,\">=\"&J$6,Data!$P$3:$P$99780,\"<\"&K$6,Data!$AE$3:$AE$99780,TRUE)","v":0},{"$f":"COUNTIFS(Data!$P$3:$P$99780,\">=\"&K$6,Data!$P$3:$P$99780,\"<\"&L$6,Data!$AE$3:$AE$99780,TRUE)","v":0},{"$f":"COUNTIFS(Data!$P$3:$P$99780,\">=\"&L$6,Data!$P$3:$P$99780,\"<\"&M$6,Data!$AE$3:$AE$99780,TRUE)","v":0},{"$f":"COUNTIFS(Data!$P$3:$P$99780,\">=\"&M$6,Data!$P$3:$P$99780,\"<\"&N$6,Data!$AE$3:$AE$99780,TRUE)","v":0},{"$f":"COUNTIFS(Data!$P$3:$P$99780,\">=\"&N$6,Data!$P$3:$P$99780,\"<\"&O$6,Data!$AE$3:$AE$99780,TRUE)","v":0},{"$f":"COUNTIFS(Data!$P$3:$P$99780,\">=\"&O$6,Data!$P$3:$P$99780,\"<\"&P$6,Data!$AE$3:$AE$99780,TRUE)","v":0},{"$f":"COUNTIFS(Data!$P$3:$P$99780,\">=\"&P$6,Data!$P$3:$P$99780,\"<\"&Q$6,Data!$AE$3:$AE$99780,TRUE)","v":0},{"$f":"COUNTIFS(Data!$P$3:$P$99780,\">=\"&Q$6,Data!$P$3:$P$99780,\"<\"&R$6,Data!$AE$3:$AE$99780,TRUE)","v":0},{"$f":"COUNTIFS(Data!$P$3:$P$99780,\">=\"&R$6,Data!$P$3:$P$99780,\"<\"&S$6,Data!$AE$3:$AE$99780,TRUE)","v":0},{"$f":"COUNTIFS(Data!$P$3:$P$99780,\">=\"&S$6,Data!$P$3:$P$99780,\"<\"&T$6,Data!$AE$3:$AE$99780,TRUE)","v":0},{"$f":"COUNTIFS(Data!$P$3:$P$99780,\">=\"&T$6,Data!$P$3:$P$99780,\"<\"&U$6,Data!$AE$3:$AE$99780,TRUE)","v":0},{"$f":"COUNTIFS(Data!$P$3:$P$99780,\">=\"&U$6,Data!$P$3:$P$99780,\"<\"&V$6,Data!$AE$3:$AE$99780,TRUE)","v":0},{"$f":"COUNTIFS(Data!$P$3:$P$99780,\">=\"&V$6,Data!$P$3:$P$99780,\"<\"&W$6,Data!$AE$3:$AE$99780,TRUE)","v":0},{"$f":"COUNTIFS(Data!$P$3:$P$99780,\">=\"&W$6,Data!$P$3:$P$99780,\"<\"&X$6,Data!$AE$3:$AE$99780,TRUE)","v":0},{"$f":"COUNTIFS(Data!$P$3:$P$99780,\">=\"&X$6,Data!$P$3:$P$99780,\"<\"&Y$6,Data!$AE$3:$AE$99780,TRUE)","v":0},{"$f":"COUNTIFS(Data!$P$3:$P$99780,\">=\"&Y$6,Data!$P$3:$P$99780,\"<\"&Z$6,Data!$AE$3:$AE$99780,TRUE)","v":0},{"$f":"COUNTIFS(Data!$P$3:$P$99780,\">=\"&Z$6,Data!$P$3:$P$99780,\"<\"&AA$6,Data!$AE$3:$AE$99780,TRUE)","v":0},{"$f":"COUNTIFS(Data!$P$3:$P$99780,\">=\"&AA$6,Data!$P$3:$P$99780,\"<\"&AB$6,Data!$AE$3:$AE$99780,TRUE)","v":0},{"$f":"COUNTIFS(Data!$P$3:$P$99780,\">=\"&AB$6,Data!$P$3:$P$99780,\"<\"&AC$6,Data!$AE$3:$AE$99780,TRUE)","v":0},{"$f":"COUNTIFS(Data!$P$3:$P$99780,\">=\"&AC$6,Data!$P$3:$P$99780,\"<\"&AD$6,Data!$AE$3:$AE$99780,TRUE)","v":0},{"$f":"COUNTIFS(Data!$P$3:$P$99780,\">=\"&AD$6,Data!$P$3:$P$99780,\"<\"&AE$6,Data!$AE$3:$AE$99780,TRUE)","v":0},{"$f":"COUNTIFS(Data!$P$3:$P$99780,\">=\"&AE$6,Data!$P$3:$P$99780,\"<\"&AF$6,Data!$AE$3:$AE$99780,TRUE)","v":0},{"$f":"COUNTIFS(Data!$P$3:$P$99780,\">=\"&AF$6,Data!$P$3:$P$99780,\"<\"&AG$6,Data!$AE$3:$AE$99780,TRUE)","v":0},{"$f":"COUNTIFS(Data!$P$3:$P$99780,\">=\"&AG$6,Data!$P$3:$P$99780,\"<\"&AH$6,Data!$AE$3:$AE$99780,TRUE)","v":0},{"$f":"COUNTIFS(Data!$P$3:$P$99780,\">=\"&AH$6,Data!$P$3:$P$99780,\"<\"&AI$6,Data!$AE$3:$AE$99780,TRUE)","v":0},{"$f":"COUNTIFS(Data!$P$3:$P$99780,\">=\"&AI$6,Data!$P$3:$P$99780,\"<\"&AJ$6,Data!$AE$3:$AE$99780,TRUE)","v":0},{"$f":"COUNTIFS(Data!$P$3:$P$99780,\">=\"&AJ$6,Data!$P$3:$P$99780,\"<\"&AK$6,Data!$AE$3:$AE$99780,TRUE)","v":0},{"$f":"COUNTIFS(Data!$P$3:$P$99780,\">=\"&AK$6,Data!$P$3:$P$99780,\"<\"&AL$6,Data!$AE$3:$AE$99780,TRUE)","v":0},{"$f":"COUNTIFS(Data!$P$3:$P$99780,\">=\"&AL$6,Data!$P$3:$P$99780,\"<\"&AM$6,Data!$AE$3:$AE$99780,TRUE)","v":0},{"$f":"COUNTIFS(Data!$P$3:$P$99780,\">=\"&AM$6,Data!$P$3:$P$99780,\"<\"&AN$6,Data!$AE$3:$AE$99780,TRUE)","v":0},{"$f":"COUNTIFS(Data!$P$3:$P$99780,\">=\"&AN$6,Data!$P$3:$P$99780,\"<\"&AO$6,Data!$AE$3:$AE$99780,TRUE)","v":0},{"$f":"COUNTIFS(Data!$P$3:$P$99780,\">=\"&AO$6,Data!$P$3:$P$99780,\"<\"&AP$6,Data!$AE$3:$AE$99780,TRUE)","v":0},{"$f":"COUNTIFS(Data!$P$3:$P$99780,\">=\"&AP$6,Data!$P$3:$P$99780,\"<\"&AQ$6,Data!$AE$3:$AE$99780,TRUE)","v":0},{"$f":"COUNTIFS(Data!$P$3:$P$99780,\">=\"&AQ$6,Data!$P$3:$P$99780,\"<\"&AR$6,Data!$AE$3:$AE$99780,TRUE)","v":0},{"$f":"COUNTIFS(Data!$P$3:$P$99780,\">=\"&AR$6,Data!$P$3:$P$99780,\"<\"&AS$6,Data!$AE$3:$AE$99780,TRUE)","v":0},{"$f":"COUNTIFS(Data!$P$3:$P$99780,\">=\"&AS$6,Data!$P$3:$P$99780,\"<\"&AT$6,Data!$AE$3:$AE$99780,TRUE)","v":0},{"$f":"COUNTIFS(Data!$P$3:$P$99780,\">=\"&AT$6,Data!$P$3:$P$99780,\"<\"&AU$6,Data!$AE$3:$AE$99780,TRUE)","v":0},{"$f":"COUNTIFS(Data!$P$3:$P$99780,\">=\"&AU$6,Data!$P$3:$P$99780,\"<\"&AV$6,Data!$AE$3:$AE$99780,TRUE)","v":0},{"$f":"COUNTIFS(Data!$P$3:$P$99780,\">=\"&AV$6,Data!$P$3:$P$99780,\"<\"&AW$6,Data!$AE$3:$AE$99780,TRUE)","v":0},{"$f":"COUNTIFS(Data!$P$3:$P$99780,\">=\"&AW$6,Data!$P$3:$P$99780,\"<\"&AX$6,Data!$AE$3:$AE$99780,TRUE)","v":0}]
["S1 end",{"$f":"COUNTIFS(Data!$O$3:$O$99780,\">=\"&B$6,Data!$O$3:$O$99780,\"<\"&C$6,Data!$AE$3:$AE$99780,TRUE)","v":0},{"$f":"COUNTIFS(Data!$O$3:$O$99780,\">=\"&C$6,Data!$O$3:$O$99780,\"<\"&D$6,Data!$AE$3:$AE$99780,TRUE)","v":0},{"$f":"COUNTIFS(Data!$O$3:$O$99780,\">=\"&D$6,Data!$O$3:$O$99780,\"<\"&E$6,Data!$AE$3:$AE$99780,TRUE)","v":0},{"$f":"COUNTIFS(Data!$O$3:$O$99780,\">=\"&E$6,Data!$O$3:$O$99780,\"<\"&F$6,Data!$AE$3:$AE$99780,TRUE)","v":0},{"$f":"COUNTIFS(Data!$O$3:$O$99780,\">=\"&F$6,Data!$O$3:$O$99780,\"<\"&G$6,Data!$AE$3:$AE$99780,TRUE)","v":0},{"$f":"COUNTIFS(Data!$O$3:$O$99780,\">=\"&G$6,Data!$O$3:$O$99780,\"<\"&H$6,Data!$AE$3:$AE$99780,TRUE)","v":0},{"$f":"COUNTIFS(Data!$O$3:$O$99780,\">=\"&H$6,Data!$O$3:$O$99780,\"<\"&I$6,Data!$AE$3:$AE$99780,TRUE)","v":0},{"$f":"COUNTIFS(Data!$O$3:$O$99780,\">=\"&I$6,Data!$O$3:$O$99780,\"<\"&J$6,Data!$AE$3:$AE$99780,TRUE)","v":0},{"$f":"COUNTIFS(Data!$O$3:$O$99780,\">=\"&J$6,Data!$O$3:$O$99780,\"<\"&K$6,Data!$AE$3:$AE$99780,TRUE)","v":0},{"$f":"COUNTIFS(Data!$O$3:$O$99780,\">=\"&K$6,Data!$O$3:$O$99780,\"<\"&L$6,Data!$AE$3:$AE$99780,TRUE)","v":0},{"$f":"COUNTIFS(Data!$O$3:$O$99780,\">=\"&L$6,Data!$O$3:$O$99780,\"<\"&M$6,Data!$AE$3:$AE$99780,TRUE)","v":0},{"$f":"COUNTIFS(Data!$O$3:$O$99780,\">=\"&M$6,Data!$O$3:$O$99780,\"<\"&N$6,Data!$AE$3:$AE$99780,TRUE)","v":0},{"$f":"COUNTIFS(Data!$O$3:$O$99780,\">=\"&N$6,Data!$O$3:$O$99780,\"<\"&O$6,Data!$AE$3:$AE$99780,TRUE)","v":0},{"$f":"COUNTIFS(Data!$O$3:$O$99780,\">=\"&O$6,Data!$O$3:$O$99780,\"<\"&P$6,Data!$AE$3:$AE$99780,TRUE)","v":0},{"$f":"COUNTIFS(Data!$O$3:$O$99780,\">=\"&P$6,Data!$O$3:$O$99780,\"<\"&Q$6,Data!$AE$3:$AE$99780,TRUE)","v":0},{"$f":"COUNTIFS(Data!$O$3:$O$99780,\">=\"&Q$6,Data!$O$3:$O$99780,\"<\"&R$6,Data!$AE$3:$AE$99780,TRUE)","v":0},{"$f":"COUNTIFS(Data!$O$3:$O$99780,\">=\"&R$6,Data!$O$3:$O$99780,\"<\"&S$6,Data!$AE$3:$AE$99780,TRUE)","v":0},{"$f":"COUNTIFS(Data!$O$3:$O$99780,\">=\"&S$6,Data!$O$3:$O$99780,\"<\"&T$6,Data!$AE$3:$AE$99780,TRUE)","v":0},{"$f":"COUNTIFS(Data!$O$3:$O$99780,\">=\"&T$6,Data!$O$3:$O$99780,\"<\"&U$6,Data!$AE$3:$AE$99780,TRUE)","v":0},{"$f":"COUNTIFS(Data!$O$3:$O$99780,\">=\"&U$6,Data!$O$3:$O$99780,\"<\"&V$6,Data!$AE$3:$AE$99780,TRUE)","v":0},{"$f":"COUNTIFS(Data!$O$3:$O$99780,\">=\"&V$6,Data!$O$3:$O$99780,\"<\"&W$6,Data!$AE$3:$AE$99780,TRUE)","v":0},{"$f":"COUNTIFS(Data!$O$3:$O$99780,\">=\"&W$6,Data!$O$3:$O$99780,\"<\"&X$6,Data!$AE$3:$AE$99780,TRUE)","v":0},{"$f":"COUNTIFS(Data!$O$3:$O$99780,\">=\"&X$6,Data!$O$3:$O$99780,\"<\"&Y$6,Data!$AE$3:$AE$99780,TRUE)","v":0},{"$f":"COUNTIFS(Data!$O$3:$O$99780,\">=\"&Y$6,Data!$O$3:$O$99780,\"<\"&Z$6,Data!$AE$3:$AE$99780,TRUE)","v":0},{"$f":"COUNTIFS(Data!$O$3:$O$99780,\">=\"&Z$6,Data!$O$3:$O$99780,\"<\"&AA$6,Data!$AE$3:$AE$99780,TRUE)","v":0},{"$f":"COUNTIFS(Data!$O$3:$O$99780,\">=\"&AA$6,Data!$O$3:$O$99780,\"<\"&AB$6,Data!$AE$3:$AE$99780,TRUE)","v":0},{"$f":"COUNTIFS(Data!$O$3:$O$99780,\">=\"&AB$6,Data!$O$3:$O$99780,\"<\"&AC$6,Data!$AE$3:$AE$99780,TRUE)","v":0},{"$f":"COUNTIFS(Data!$O$3:$O$99780,\">=\"&AC$6,Data!$O$3:$O$99780,\"<\"&AD$6,Data!$AE$3:$AE$99780,TRUE)","v":0},{"$f":"COUNTIFS(Data!$O$3:$O$99780,\">=\"&AD$6,Data!$O$3:$O$99780,\"<\"&AE$6,Data!$AE$3:$AE$99780,TRUE)","v":0},{"$f":"COUNTIFS(Data!$O$3:$O$99780,\">=\"&AE$6,Data!$O$3:$O$99780,\"<\"&AF$6,Data!$AE$3:$AE$99780,TRUE)","v":0},{"$f":"COUNTIFS(Data!$O$3:$O$99780,\">=\"&AF$6,Data!$O$3:$O$99780,\"<\"&AG$6,Data!$AE$3:$AE$99780,TRUE)","v":0},{"$f":"COUNTIFS(Data!$O$3:$O$99780,\">=\"&AG$6,Data!$O$3:$O$99780,\"<\"&AH$6,Data!$AE$3:$AE$99780,TRUE)","v":0},{"$f":"COUNTIFS(Data!$O$3:$O$99780,\">=\"&AH$6,Data!$O$3:$O$99780,\"<\"&AI$6,Data!$AE$3:$AE$99780,TRUE)","v":0},{"$f":"COUNTIFS(Data!$O$3:$O$99780,\">=\"&AI$6,Data!$O$3:$O$99780,\"<\"&AJ$6,Data!$AE$3:$AE$99780,TRUE)","v":0},{"$f":"COUNTIFS(Data!$O$3:$O$99780,\">=\"&AJ$6,Data!$O$3:$O$99780,\"<\"&AK$6,Data!$AE$3:$AE$99780,TRUE)","v":0},{"$f":"COUNTIFS(Data!$O$3:$O$99780,\">=\"&AK$6,Data!$O$3:$O$99780,\"<\"&AL$6,Data!$AE$3:$AE$99780,TRUE)","v":0},{"$f":"COUNTIFS(Data!$O$3:$O$99780,\">=\"&AL$6,Data!$O$3:$O$99780,\"<\"&AM$6,Data!$AE$3:$AE$99780,TRUE)","v":0},{"$f":"COUNTIFS(Data!$O$3:$O$99780,\">=\"&AM$6,Data!$O$3:$O$99780,\"<\"&AN$6,Data!$AE$3:$AE$99780,TRUE)","v":0},{"$f":"COUNTIFS(Data!$O$3:$O$99780,\">=\"&AN$6,Data!$O$3:$O$99780,\"<\"&AO$6,Data!$AE$3:$AE$99780,TRUE)","v":0},{"$f":"COUNTIFS(Data!$O$3:$O$99780,\">=\"&AO$6,Data!$O$3:$O$99780,\"<\"&AP$6,Data!$AE$3:$AE$99780,TRUE)","v":0},{"$f":"COUNTIFS(Data!$O$3:$O$99780,\">=\"&AP$6,Data!$O$3:$O$99780,\"<\"&AQ$6,Data!$AE$3:$AE$99780,TRUE)","v":0},{"$f":"COUNTIFS(Data!$O$3:$O$99780,\">=\"&AQ$6,Data!$O$3:$O$99780,\"<\"&AR$6,Data!$AE$3:$AE$99780,TRUE)","v":0},{"$f":"COUNTIFS(Data!$O$3:$O$99780,\">=\"&AR$6,Data!$O$3:$O$99780,\"<\"&AS$6,Data!$AE$3:$AE$99780,TRUE)","v":0},{"$f":"COUNTIFS(Data!$O$3:$O$99780,\">=\"&AS$6,Data!$O$3:$O$99780,\"<\"&AT$6,Data!$AE$3:$AE$99780,TRUE)","v":0},{"$f":"COUNTIFS(Data!$O$3:$O$99780,\">=\"&AT$6,Data!$O$3:$O$99780,\"<\"&AU$6,Data!$AE$3:$AE$99780,TRUE)","v":0},{"$f":"COUNTIFS(Data!$O$3:$O$99780,\">=\"&AU$6,Data!$O$3:$O$99780,\"<\"&AV$6,Data!$AE$3:$AE$99780,TRUE)","v":0},{"$f":"COUNTIFS(Data!$O$3:$O$99780,\">=\"&AV$6,Data!$O$3:$O$99780,\"<\"&AW$6,Data!$AE$3:$AE$99780,TRUE)","v":0},{"$f":"COUNTIFS(Data!$O$3:$O$99780,\">=\"&AW$6,Data!$O$3:$O$99780,\"<\"&AX$6,Data!$AE$3:$AE$99780,TRUE)","v":0}]
["S1 start",{"$f":"COUNTIFS(Data!$N$3:$N$99780,\">=\"&B$6,Data!$N$3:$N$99780,\"<\"&C$6,Data!$AE$3:$AE$99780,TRUE)","v":0},{"$f":"COUNTIFS(Data!$N$3:$N$99780,\">=\"&C$6,Data!$N$3:$N$99780,\"<\"&D$6,Data!$AE$3:$AE$99780,TRUE)","v":0},{"$f":"COUNTIFS(Data!$N$3:$N$99780,\">=\"&D$6,Data!$N$3:$N$99780,\"<\"&E$6,Data!$AE$3:$AE$99780,TRUE)","v":0},{"$f":"COUNTIFS(Data!$N$3:$N$99780,\">=\"&E$6,Data!$N$3:$N$99780,\"<\"&F$6,Data!$AE$3:$AE$99780,TRUE)","v":0},{"$f":"COUNTIFS(Data!$N$3:$N$99780,\">=\"&F$6,Data!$N$3:$N$99780,\"<\"&G$6,Data!$AE$3:$AE$99780,TRUE)","v":0},{"$f":"COUNTIFS(Data!$N$3:$N$99780,\">=\"&G$6,Data!$N$3:$N$99780,\"<\"&H$6,Data!$AE$3:$AE$99780,TRUE)","v":0},{"$f":"COUNTIFS(Data!$N$3:$N$99780,\">=\"&H$6,Data!$N$3:$N$99780,\"<\"&I$6,Data!$AE$3:$AE$99780,TRUE)","v":0},{"$f":"COUNTIFS(Data!$N$3:$N$99780,\">=\"&I$6,Data!$N$3:$N$99780,\"<\"&J$6,Data!$AE$3:$AE$99780,TRUE)","v":0},{"$f":"COUNTIFS(Data!$N$3:$N$99780,\">=\"&J$6,Data!$N$3:$N$99780,\"<\"&K$6,Data!$AE$3:$AE$99780,TRUE)","v":0},{"$f":"COUNTIFS(Data!$N$3:$N$99780,\">=\"&K$6,Data!$N$3:$N$99780,\"<\"&L$6,Data!$AE$3:$AE$99780,TRUE)","v":0},{"$f":"COUNTIFS(Data!$N$3:$N$99780,\">=\"&L$6,Data!$N$3:$N$99780,\"<\"&M$6,Data!$AE$3:$AE$99780,TRUE)","v":0},{"$f":"COUNTIFS(Data!$N$3:$N$99780,\">=\"&M$6,Data!$N$3:$N$99780,\"<\"&N$6,Data!$AE$3:$AE$99780,TRUE)","v":0},{"$f":"COUNTIFS(Data!$N$3:$N$99780,\">=\"&N$6,Data!$N$3:$N$99780,\"<\"&O$6,Data!$AE$3:$AE$99780,TRUE)","v":0},{"$f":"COUNTIFS(Data!$N$3:$N$99780,\">=\"&O$6,Data!$N$3:$N$99780,\"<\"&P$6,Data!$AE$3:$AE$99780,TRUE)","v":0},{"$f":"COUNTIFS(Data!$N$3:$N$99780,\">=\"&P$6,Data!$N$3:$N$99780,\"<\"&Q$6,Data!$AE$3:$AE$99780,TRUE)","v":0},{"$f":"COUNTIFS(Data!$N$3:$N$99780,\">=\"&Q$6,Data!$N$3:$N$99780,\"<\"&R$6,Data!$AE$3:$AE$99780,TRUE)","v":0},{"$f":"COUNTIFS(Data!$N$3:$N$99780,\">=\"&R$6,Data!$N$3:$N$99780,\"<\"&S$6,Data!$AE$3:$AE$99780,TRUE)","v":0},{"$f":"COUNTIFS(Data!$N$3:$N$99780,\">=\"&S$6,Data!$N$3:$N$99780,\"<\"&T$6,Data!$AE$3:$AE$99780,TRUE)","v":0},{"$f":"COUNTIFS(Data!$N$3:$N$99780,\">=\"&T$6,Data!$N$3:$N$99780,\"<\"&U$6,Data!$AE$3:$AE$99780,TRUE)","v":0},{"$f":"COUNTIFS(Data!$N$3:$N$99780,\">=\"&U$6,Data!$N$3:$N$99780,\"<\"&V$6,Data!$AE$3:$AE$99780,TRUE)","v":0},{"$f":"COUNTIFS(Data!$N$3:$N$99780,\">=\"&V$6,Data!$N$3:$N$99780,\"<\"&W$6,Data!$AE$3:$AE$99780,TRUE)","v":0},{"$f":"COUNTIFS(Data!$N$3:$N$99780,\">=\"&W$6,Data!$N$3:$N$99780,\"<\"&X$6,Data!$AE$3:$AE$99780,TRUE)","v":0},{"$f":"COUNTIFS(Data!$N$3:$N$99780,\">=\"&X$6,Data!$N$3:$N$99780,\"<\"&Y$6,Data!$AE$3:$AE$99780,TRUE)","v":0},{"$f":"COUNTIFS(Data!$N$3:$N$99780,\">=\"&Y$6,Data!$N$3:$N$99780,\"<\"&Z$6,Data!$AE$3:$AE$99780,TRUE)","v":0},{"$f":"COUNTIFS(Data!$N$3:$N$99780,\">=\"&Z$6,Data!$N$3:$N$99780,\"<\"&AA$6,Data!$AE$3:$AE$99780,TRUE)","v":0},{"$f":"COUNTIFS(Data!$N$3:$N$99780,\">=\"&AA$6,Data!$N$3:$N$99780,\"<\"&AB$6,Data!$AE$3:$AE$99780,TRUE)","v":0},{"$f":"COUNTIFS(Data!$N$3:$N$99780,\">=\"&AB$6,Data!$N$3:$N$99780,\"<\"&AC$6,Data!$AE$3:$AE$99780,TRUE)","v":0},{"$f":"COUNTIFS(Data!$N$3:$N$99780,\">=\"&AC$6,Data!$N$3:$N$99780,\"<\"&AD$6,Data!$AE$3:$AE$99780,TRUE)","v":0},{"$f":"COUNTIFS(Data!$N$3:$N$99780,\">=\"&AD$6,Data!$N$3:$N$99780,\"<\"&AE$6,Data!$AE$3:$AE$99780,TRUE)","v":0},{"$f":"COUNTIFS(Data!$N$3:$N$99780,\">=\"&AE$6,Data!$N$3:$N$99780,\"<\"&AF$6,Data!$AE$3:$AE$99780,TRUE)","v":0},{"$f":"COUNTIFS(Data!$N$3:$N$99780,\">=\"&AF$6,Data!$N$3:$N$99780,\"<\"&AG$6,Data!$AE$3:$AE$99780,TRUE)","v":0},{"$f":"COUNTIFS(Data!$N$3:$N$99780,\">=\"&AG$6,Data!$N$3:$N$99780,\"<\"&AH$6,Data!$AE$3:$AE$99780,TRUE)","v":0},{"$f":"COUNTIFS(Data!$N$3:$N$99780,\">=\"&AH$6,Data!$N$3:$N$99780,\"<\"&AI$6,Data!$AE$3:$AE$99780,TRUE)","v":0},{"$f":"COUNTIFS(Data!$N$3:$N$99780,\">=\"&AI$6,Data!$N$3:$N$99780,\"<\"&AJ$6,Data!$AE$3:$AE$99780,TRUE)","v":0},{"$f":"COUNTIFS(Data!$N$3:$N$99780,\">=\"&AJ$6,Data!$N$3:$N$99780,\"<\"&AK$6,Data!$AE$3:$AE$99780,TRUE)","v":0},{"$f":"COUNTIFS(Data!$N$3:$N$99780,\">=\"&AK$6,Data!$N$3:$N$99780,\"<\"&AL$6,Data!$AE$3:$AE$99780,TRUE)","v":0},{"$f":"COUNTIFS(Data!$N$3:$N$99780,\">=\"&AL$6,Data!$N$3:$N$99780,\"<\"&AM$6,Data!$AE$3:$AE$99780,TRUE)","v":0},{"$f":"COUNTIFS(Data!$N$3:$N$99780,\">=\"&AM$6,Data!$N$3:$N$99780,\"<\"&AN$6,Data!$AE$3:$AE$99780,TRUE)","v":0},{"$f":"COUNTIFS(Data!$N$3:$N$99780,\">=\"&AN$6,Data!$N$3:$N$99780,\"<\"&AO$6,Data!$AE$3:$AE$99780,TRUE)","v":0},{"$f":"COUNTIFS(Data!$N$3:$N$99780,\">=\"&AO$6,Data!$N$3:$N$99780,\"<\"&AP$6,Data!$AE$3:$AE$99780,TRUE)","v":0},{"$f":"COUNTIFS(Data!$N$3:$N$99780,\">=\"&AP$6,Data!$N$3:$N$99780,\"<\"&AQ$6,Data!$AE$3:$AE$99780,TRUE)","v":0},{"$f":"COUNTIFS(Data!$N$3:$N$99780,\">=\"&AQ$6,Data!$N$3:$N$99780,\"<\"&AR$6,Data!$AE$3:$AE$99780,TRUE)","v":0},{"$f":"COUNTIFS(Data!$N$3:$N$99780,\">=\"&AR$6,Data!$N$3:$N$99780,\"<\"&AS$6,Data!$AE$3:$AE$99780,TRUE)","v":0},{"$f":"COUNTIFS(Data!$N$3:$N$99780,\">=\"&AS$6,Data!$N$3:$N$99780,\"<\"&AT$6,Data!$AE$3:$AE$99780,TRUE)","v":0},{"$f":"COUNTIFS(Data!$N$3:$N$99780,\">=\"&AT$6,Data!$N$3:$N$99780,\"<\"&AU$6,Data!$AE$3:$AE$99780,TRUE)","v":0},{"$f":"COUNTIFS(Data!$N$3:$N$99780,\">=\"&AU$6,Data!$N$3:$N$99780,\"<\"&AV$6,Data!$AE$3:$AE$99780,TRUE)","v":0},{"$f":"COUNTIFS(Data!$N$3:$N$99780,\">=\"&AV$6,Data!$N$3:$N$99780,\"<\"&AW$6,Data!$AE$3:$AE$99780,TRUE)","v":0},{"$f":"COUNTIFS(Data!$N$3:$N$99780,\">=\"&AW$6,Data!$N$3:$N$99780,\"<\"&AX$6,Data!$AE$3:$AE$99780,TRUE)","v":0}]
["Post-approval withdrawal",{"$f":"COUNTIFS(Data!$Q$3:$Q$99780,\"<>\",Data!$W$3:$W$99780,\"<\"&C$6,Data!$W$3:$W$99780,\">=\"&B$6,Data!$X$3:$X$99780,1,Data!$AE$3:$AE$99780,TRUE)","v":0},{"$f":"COUNTIFS(Data!$Q$3:$Q$99780,\"<>\",Data!$W$3:$W$99780,\"<\"&D$6,Data!$W$3:$W$99780,\">=\"&C$6,Data!$X$3:$X$99780,1,Data!$AE$3:$AE$99780,TRUE)","v":0},{"$f":"COUNTIFS(Data!$Q$3:$Q$99780,\"<>\",Data!$W$3:$W$99780,\"<\"&E$6,Data!$W$3:$W$99780,\">=\"&D$6,Data!$X$3:$X$99780,1,Data!$AE$3:$AE$99780,TRUE)","v":0},{"$f":"COUNTIFS(Data!$Q$3:$Q$99780,\"<>\",Data!$W$3:$W$99780,\"<\"&F$6,Data!$W$3:$W$99780,\">=\"&E$6,Data!$X$3:$X$99780,1,Data!$AE$3:$AE$99780,TRUE)","v":0},{"$f":"COUNTIFS(Data!$Q$3:$Q$99780,\"<>\",Data!$W$3:$W$99780,\"<\"&G$6,Data!$W$3:$W$99780,\">=\"&F$6,Data!$X$3:$X$99780,1,Data!$AE$3:$AE$99780,TRUE)","v":0},{"$f":"COUNTIFS(Data!$Q$3:$Q$99780,\"<>\",Data!$W$3:$W$99780,\"<\"&H$6,Data!$W$3:$W$99780,\">=\"&G$6,Data!$X$3:$X$99780,1,Data!$AE$3:$AE$99780,TRUE)","v":0},{"$f":"COUNTIFS(Data!$Q$3:$Q$99780,\"<>\",Data!$W$3:$W$99780,\"<\"&I$6,Data!$W$3:$W$99780,\">=\"&H$6,Data!$X$3:$X$99780,1,Data!$AE$3:$AE$99780,TRUE)","v":0},{"$f":"COUNTIFS(Data!$Q$3:$Q$99780,\"<>\",Data!$W$3:$W$99780,\"<\"&J$6,Data!$W$3:$W$99780,\">=\"&I$6,Data!$X$3:$X$99780,1,Data!$AE$3:$AE$99780,TRUE)","v":0},{"$f":"COUNTIFS(Data!$Q$3:$Q$99780,\"<>\",Data!$W$3:$W$99780,\"<\"&K$6,Data!$W$3:$W$99780,\">=\"&J$6,Data!$X$3:$X$99780,1,Data!$AE$3:$AE$99780,TRUE)","v":0},{"$f":"COUNTIFS(Data!$Q$3:$Q$99780,\"<>\",Data!$W$3:$W$99780,\"<\"&L$6,Data!$W$3:$W$99780,\">=\"&K$6,Data!$X$3:$X$99780,1,Data!$AE$3:$AE$99780,TRUE)","v":0},{"$f":"COUNTIFS(Data!$Q$3:$Q$99780,\"<>\",Data!$W$3:$W$99780,\"<\"&M$6,Data!$W$3:$W$99780,\">=\"&L$6,Data!$X$3:$X$99780,1,Data!$AE$3:$AE$99780,TRUE)","v":0},{"$f":"COUNTIFS(Data!$Q$3:$Q$99780,\"<>\",Data!$W$3:$W$99780,\"<\"&N$6,Data!$W$3:$W$99780,\">=\"&M$6,Data!$X$3:$X$99780,1,Data!$AE$3:$AE$99780,TRUE)","v":0},{"$f":"COUNTIFS(Data!$Q$3:$Q$99780,\"<>\",Data!$W$3:$W$99780,\"<\"&O$6,Data!$W$3:$W$99780,\">=\"&N$6,Data!$X$3:$X$99780,1,Data!$AE$3:$AE$99780,TRUE)","v":0},{"$f":"COUNTIFS(Data!$Q$3:$Q$99780,\"<>\",Data!$W$3:$W$99780,\"<\"&P$6,Data!$W$3:$W$99780,\">=\"&O$6,Data!$X$3:$X$99780,1,Data!$AE$3:$AE$99780,TRUE)","v":0},{"$f":"COUNTIFS(Data!$Q$3:$Q$99780,\"<>\",Data!$W$3:$W$99780,\"<\"&Q$6,Data!$W$3:$W$99780,\">=\"&P$6,Data!$X$3:$X$99780,1,Data!$AE$3:$AE$99780,TRUE)","v":0},{"$f":"COUNTIFS(Data!$Q$3:$Q$99780,\"<>\",Data!$W$3:$W$99780,\"<\"&R$6,Data!$W$3:$W$99780,\">=\"&Q$6,Data!$X$3:$X$99780,1,Data!$AE$3:$AE$99780,TRUE)","v":0},{"$f":"COUNTIFS(Data!$Q$3:$Q$99780,\"<>\",Data!$W$3:$W$99780,\"<\"&S$6,Data!$W$3:$W$99780,\">=\"&R$6,Data!$X$3:$X$99780,1,Data!$AE$3:$AE$99780,TRUE)","v":0},{"$f":"COUNTIFS(Data!$Q$3:$Q$99780,\"<>\",Data!$W$3:$W$99780,\"<\"&T$6,Data!$W$3:$W$99780,\">=\"&S$6,Data!$X$3:$X$99780,1,Data!$AE$3:$AE$99780,TRUE)","v":0},{"$f":"COUNTIFS(Data!$Q$3:$Q$99780,\"<>\",Data!$W$3:$W$99780,\"<\"&U$6,Data!$W$3:$W$99780,\">=\"&T$6,Data!$X$3:$X$99780,1,Data!$AE$3:$AE$99780,TRUE)","v":0},{"$f":"COUNTIFS(Data!$Q$3:$Q$99780,\"<>\",Data!$W$3:$W$99780,\"<\"&V$6,Data!$W$3:$W$99780,\">=\"&U$6,Data!$X$3:$X$99780,1,Data!$AE$3:$AE$99780,TRUE)","v":0},{"$f":"COUNTIFS(Data!$Q$3:$Q$99780,\"<>\",Data!$W$3:$W$99780,\"<\"&W$6,Data!$W$3:$W$99780,\">=\"&V$6,Data!$X$3:$X$99780,1,Data!$AE$3:$AE$99780,TRUE)","v":0},{"$f":"COUNTIFS(Data!$Q$3:$Q$99780,\"<>\",Data!$W$3:$W$99780,\"<\"&X$6,Data!$W$3:$W$99780,\">=\"&W$6,Data!$X$3:$X$99780,1,Data!$AE$3:$AE$99780,TRUE)","v":0},{"$f":"COUNTIFS(Data!$Q$3:$Q$99780,\"<>\",Data!$W$3:$W$99780,\"<\"&Y$6,Data!$W$3:$W$99780,\">=\"&X$6,Data!$X$3:$X$99780,1,Data!$AE$3:$AE$99780,TRUE)","v":0},{"$f":"COUNTIFS(Data!$Q$3:$Q$99780,\"<>\",Data!$W$3:$W$99780,\"<\"&Z$6,Data!$W$3:$W$99780,\">=\"&Y$6,Data!$X$3:$X$99780,1,Data!$AE$3:$AE$99780,TRUE)","v":0},{"$f":"COUNTIFS(Data!$Q$3:$Q$99780,\"<>\",Data!$W$3:$W$99780,\"<\"&AA$6,Data!$W$3:$W$99780,\">=\"&Z$6,Data!$X$3:$X$99780,1,Data!$AE$3:$AE$99780,TRUE)","v":0},{"$f":"COUNTIFS(Data!$Q$3:$Q$99780,\"<>\",Data!$W$3:$W$99780,\"<\"&AB$6,Data!$W$3:$W$99780,\">=\"&AA$6,Data!$X$3:$X$99780,1,Data!$AE$3:$AE$99780,TRUE)","v":0},{"$f":"COUNTIFS(Data!$Q$3:$Q$99780,\"<>\",Data!$W$3:$W$99780,\"<\"&AC$6,Data!$W$3:$W$99780,\">=\"&AB$6,Data!$X$3:$X$99780,1,Data!$AE$3:$AE$99780,TRUE)","v":0},{"$f":"COUNTIFS(Data!$Q$3:$Q$99780,\"<>\",Data!$W$3:$W$99780,\"<\"&AD$6,Data!$W$3:$W$99780,\">=\"&AC$6,Data!$X$3:$X$99780,1,Data!$AE$3:$AE$99780,TRUE)","v":0},{"$f":"COUNTIFS(Data!$Q$3:$Q$99780,\"<>\",Data!$W$3:$W$99780,\"<\"&AE$6,Data!$W$3:$W$99780,\">=\"&AD$6,Data!$X$3:$X$99780,1,Data!$AE$3:$AE$99780,TRUE)","v":0},{"$f":"COUNTIFS(Data!$Q$3:$Q$99780,\"<>\",Data!$W$3:$W$99780,\"<\"&AF$6,Data!$W$3:$W$99780,\">=\"&AE$6,Data!$X$3:$X$99780,1,Data!$AE$3:$AE$99780,TRUE)","v":0},{"$f":"COUNTIFS(Data!$Q$3:$Q$99780,\"<>\",Data!$W$3:$W$99780,\"<\"&AG$6,Data!$W$3:$W$99780,\">=\"&AF$6,Data!$X$3:$X$99780,1,Data!$AE$3:$AE$99780,TRUE)","v":0},{"$f":"COUNTIFS(Data!$Q$3:$Q$99780,\"<>\",Data!$W$3:$W$99780,\"<\"&AH$6,Data!$W$3:$W$99780,\">=\"&AG$6,Data!$X$3:$X$99780,1,Data!$AE$3:$AE$99780,TRUE)","v":0},{"$f":"COUNTIFS(Data!$Q$3:$Q$99780,\"<>\",Data!$W$3:$W$99780,\"<\"&AI$6,Data!$W$3:$W$99780,\">=\"&AH$6,Data!$X$3:$X$99780,1,Data!$AE$3:$AE$99780,TRUE)","v":0},{"$f":"COUNTIFS(Data!$Q$3:$Q$99780,\"<>\",Data!$W$3:$W$99780,\"<\"&AJ$6,Data!$W$3:$W$99780,\">=\"&AI$6,Data!$X$3:$X$99780,1,Data!$AE$3:$AE$99780,TRUE)","v":0},{"$f":"COUNTIFS(Data!$Q$3:$Q$99780,\"<>\",Data!$W$3:$W$99780,\"<\"&AK$6,Data!$W$3:$W$99780,\">=\"&AJ$6,Data!$X$3:$X$99780,1,Data!$AE$3:$AE$99780,TRUE)","v":0},{"$f":"COUNTIFS(Data!$Q$3:$Q$99780,\"<>\",Data!$W$3:$W$99780,\"<\"&AL$6,Data!$W$3:$W$99780,\">=\"&AK$6,Data!$X$3:$X$99780,1,Data!$AE$3:$AE$99780,TRUE)","v":0},{"$f":"COUNTIFS(Data!$Q$3:$Q$99780,\"<>\",Data!$W$3:$W$99780,\"<\"&AM$6,Data!$W$3:$W$99780,\">=\"&AL$6,Data!$X$3:$X$99780,1,Data!$AE$3:$AE$99780,TRUE)","v":0},{"$f":"COUNTIFS(Data!$Q$3:$Q$99780,\"<>\",Data!$W$3:$W$99780,\"<\"&AN$6,Data!$W$3:$W$99780,\">=\"&AM$6,Data!$X$3:$X$99780,1,Data!$AE$3:$AE$99780,TRUE)","v":0},{"$f":"COUNTIFS(Data!$Q$3:$Q$99780,\"<>\",Data!$W$3:$W$99780,\"<\"&AO$6,Data!$W$3:$W$99780,\">=\"&AN$6,Data!$X$3:$X$99780,1,Data!$AE$3:$AE$99780,TRUE)","v":0},{"$f":"COUNTIFS(Data!$Q$3:$Q$99780,\"<>\",Data!$W$3:$W$99780,\"<\"&AP$6,Data!$W$3:$W$99780,\">=\"&AO$6,Data!$X$3:$X$99780,1,Data!$AE$3:$AE$99780,TRUE)","v":0},{"$f":"COUNTIFS(Data!$Q$3:$Q$99780,\"<>\",Data!$W$3:$W$99780,\"<\"&AQ$6,Data!$W$3:$W$99780,\">=\"&AP$6,Data!$X$3:$X$99780,1,Data!$AE$3:$AE$99780,TRUE)","v":0},{"$f":"COUNTIFS(Data!$Q$3:$Q$99780,\"<>\",Data!$W$3:$W$99780,\"<\"&AR$6,Data!$W$3:$W$99780,\">=\"&AQ$6,Data!$X$3:$X$99780,1,Data!$AE$3:$AE$99780,TRUE)","v":0},{"$f":"COUNTIFS(Data!$Q$3:$Q$99780,\"<>\",Data!$W$3:$W$99780,\"<\"&AS$6,Data!$W$3:$W$99780,\">=\"&AR$6,Data!$X$3:$X$99780,1,Data!$AE$3:$AE$99780,TRUE)","v":0},{"$f":"COUNTIFS(Data!$Q$3:$Q$99780,\"<>\",Data!$W$3:$W$99780,\"<\"&AT$6,Data!$W$3:$W$99780,\">=\"&AS$6,Data!$X$3:$X$99780,1,Data!$AE$3:$AE$99780,TRUE)","v":0},{"$f":"COUNTIFS(Data!$Q$3:$Q$99780,\"<>\",Data!$W$3:$W$99780,\"<\"&AU$6,Data!$W$3:$W$99780,\">=\"&AT$6,Data!$X$3:$X$99780,1,Data!$AE$3:$AE$99780,TRUE)","v":0},{"$f":"COUNTIFS(Data!$Q$3:$Q$99780,\"<>\",Data!$W$3:$W$99780,\"<\"&AV$6,Data!$W$3:$W$99780,\">=\"&AU$6,Data!$X$3:$X$99780,1,Data!$AE$3:$AE$99780,TRUE)","v":0},{"$f":"COUNTIFS(Data!$Q$3:$Q$99780,\"<>\",Data!$W$3:$W$99780,\"<\"&AW$6,Data!$W$3:$W$99780,\">=\"&AV$6,Data!$X$3:$X$99780,1,Data!$AE$3:$AE$99780,TRUE)","v":0},{"$f":"COUNTIFS(Data!$Q$3:$Q$99780,\"<>\",Data!$W$3:$W$99780,\"<\"&AX$6,Data!$W$3:$W$99780,\">=\"&AW$6,Data!$X$3:$X$99780,1,Data!$AE$3:$AE$99780,TRUE)","v":0}]
["S2 refusal/withdrawal",{"$f":"COUNTIFS(Data!$P$3:$P$99780,\"<>\",Data!$Q$3:$Q$99780,\"\",Data!$R$3:$R$99780,\"\",Data!$S$3:$S$99780,\"\",Data!$U$3:$U$99780,\"\",Data!$W$3:$W$99780,\"<\"&C$6,Data!$W$3:$W$99780,\">=\"&B$6,Data!$X$3:$X$99780,\"<>2\",Data!$AE$3:$AE$99780,TRUE)","v":0},{"$f":"COUNTIFS(Data!$P$3:$P$99780,\"<>\",Data!$Q$3:$Q$99780,\"\",Data!$R$3:$R$99780,\"\",Data!$S$3:$S$99780,\"\",Data!$U$3:$U$99780,\"\",Data!$W$3:$W$99780,\"<\"&D$6,Data!$W$3:$W$99780,\">=\"&C$6,Data!$X$3:$X$99780,\"<>2\",Data!$AE$3:$AE$99780,TRUE)","v":0},{"$f":"COUNTIFS(Data!$P$3:$P$99780,\"<>\",Data!$Q$3:$Q$99780,\"\",Data!$R$3:$R$99780,\"\",Data!$S$3:$S$99780,\"\",Data!$U$3:$U$99780,\"\",Data!$W$3:$W$99780,\"<\"&E$6,Data!$W$3:$W$99780,\">=\"&D$6,Data!$X$3:$X$99780,\"<>2\",Data!$AE$3:$AE$99780,TRUE)","v":0},{"$f":"COUNTIFS(Data!$P$3:$P$99780,\"<>\",Data!$Q$3:$Q$99780,\"\",Data!$R$3:$R$99780,\"\",Data!$S$3:$S$99780,\"\",Data!$U$3:$U$99780,\"\",Data!$W$3:$W$99780,\"<\"&F$6,Data!$W$3:$W$99780,\">=\"&E$6,Data!$X$3:$X$99780,\"<>2\",Data!$AE$3:$AE$99780,TRUE)","v":0},{"$f":"COUNTIFS(Data!$P$3:$P$99780,\"<>\",Data!$Q$3:$Q$99780,\"\",Data!$R$3:$R$99780,\"\",Data!$S$3:$S$99780,\"\",Data!$U$3:$U$99780,\"\",Data!$W$3:$W$99780,\"<\"&G$6,Data!$W$3:$W$99780,\">=\"&F$6,Data!$X$3:$X$99780,\"<>2\",Data!$AE$3:$AE$99780,TRUE)","v":0},{"$f":"COUNTIFS(Data!$P$3:$P$99780,\"<>\",Data!$Q$3:$Q$99780,\"\",Data!$R$3:$R$99780,\"\",Data!$S$3:$S$99780,\"\",Data!$U$3:$U$99780,\"\",Data!$W$3:$W$99780,\"<\"&H$6,Data!$W$3:$W$99780,\">=\"&G$6,Data!$X$3:$X$99780,\"<>2\",Data!$AE$3:$AE$99780,TRUE)","v":0},{"$f":"COUNTIFS(Data!$P$3:$P$99780,\"<>\",Data!$Q$3:$Q$99780,\"\",Data!$R$3:$R$99780,\"\",Data!$S$3:$S$99780,\"\",Data!$U$3:$U$99780,\"\",Data!$W$3:$W$99780,\"<\"&I$6,Data!$W$3:$W$99780,\">=\"&H$6,Data!$X$3:$X$99780,\"<>2\",Data!$AE$3:$AE$99780,TRUE)","v":0},{"$f":"COUNTIFS(Data!$P$3:$P$99780,\"<>\",Data!$Q$3:$Q$99780,\"\",Data!$R$3:$R$99780,\"\",Data!$S$3:$S$99780,\"\",Data!$U$3:$U$99780,\"\",Data!$W$3:$W$99780,\"<\"&J$6,Data!$W$3:$W$99780,\">=\"&I$6,Data!$X$3:$X$99780,\"<>2\",Data!$AE$3:$AE$99780,TRUE)","v":0},{"$f":"COUNTIFS(Data!$P$3:$P$99780,\"<>\",Data!$Q$3:$Q$99780,\"\",Data!$R$3:$R$99780,\"\",Data!$S$3:$S$99780,\"\",Data!$U$3:$U$99780,\"\",Data!$W$3:$W$99780,\"<\"&K$6,Data!$W$3:$W$99780,\">=\"&J$6,Data!$X$3:$X$99780,\"<>2\",Data!$AE$3:$AE$99780,TRUE)","v":0},{"$f":"COUNTIFS(Data!$P$3:$P$99780,\"<>\",Data!$Q$3:$Q$99780,\"\",Data!$R$3:$R$99780,\"\",Data!$S$3:$S$99780,\"\",Data!$U$3:$U$99780,\"\",Data!$W$3:$W$99780,\"<\"&L$6,Data!$W$3:$W$99780,\">=\"&K$6,Data!$X$3:$X$99780,\"<>2\",Data!$AE$3:$AE$99780,TRUE)","v":0},{"$f":"COUNTIFS(Data!$P$3:$P$99780,\"<>\",Data!$Q$3:$Q$99780,\"\",Data!$R$3:$R$99780,\"\",Data!$S$3:$S$99780,\"\",Data!$U$3:$U$99780,\"\",Data!$W$3:$W$99780,\"<\"&M$6,Data!$W$3:$W$99780,\">=\"&L$6,Data!$X$3:$X$99780,\"<>2\",Data!$AE$3:$AE$99780,TRUE)","v":0},{"$f":"COUNTIFS(Data!$P$3:$P$99780,\"<>\",Data!$Q$3:$Q$99780,\"\",Data!$R$3:$R$99780,\"\",Data!$S$3:$S$99780,\"\",Data!$U$3:$U$99780,\"\",Data!$W$3:$W$99780,\"<\"&N$6,Data!$W$3:$W$99780,\">=\"&M$6,Data!$X$3:$X$99780,\"<>2\",Data!$AE$3:$AE$99780,TRUE)","v":0},{"$f":"COUNTIFS(Data!$P$3:$P$99780,\"<>\",Data!$Q$3:$Q$99780,\"\",Data!$R$3:$R$99780,\"\",Data!$S$3:$S$99780,\"\",Data!$U$3:$U$99780,\"\",Data!$W$3:$W$99780,\"<\"&O$6,Data!$W$3:$W$99780,\">=\"&N$6,Data!$X$3:$X$99780,\"<>2\",Data!$AE$3:$AE$99780,TRUE)","v":0},{"$f":"COUNTIFS(Data!$P$3:$P$99780,\"<>\",Data!$Q$3:$Q$99780,\"\",Data!$R$3:$R$99780,\"\",Data!$S$3:$S$99780,\"\",Data!$U$3:$U$99780,\"\",Data!$W$3:$W$99780,\"<\"&P$6,Data!$W$3:$W$99780,\">=\"&O$6,Data!$X$3:$X$99780,\"<>2\",Data!$AE$3:$AE$99780,TRUE)","v":0},{"$f":"COUNTIFS(Data!$P$3:$P$99780,\"<>\",Data!$Q$3:$Q$99780,\"\",Data!$R$3:$R$99780,\"\",Data!$S$3:$S$99780,\"\",Data!$U$3:$U$99780,\"\",Data!$W$3:$W$99780,\"<\"&Q$6,Data!$W$3:$W$99780,\">=\"&P$6,Data!$X$3:$X$99780,\"<>2\",Data!$AE$3:$AE$99780,TRUE)","v":0},{"$f":"COUNTIFS(Data!$P$3:$P$99780,\"<>\",Data!$Q$3:$Q$99780,\"\",Data!$R$3:$R$99780,\"\",Data!$S$3:$S$99780,\"\",Data!$U$3:$U$99780,\"\",Data!$W$3:$W$99780,\"<\"&R$6,Data!$W$3:$W$99780,\">=\"&Q$6,Data!$X$3:$X$99780,\"<>2\",Data!$AE$3:$AE$99780,TRUE)","v":0},{"$f":"COUNTIFS(Data!$P$3:$P$99780,\"<>\",Data!$Q$3:$Q$99780,\"\",Data!$R$3:$R$99780,\"\",Data!$S$3:$S$99780,\"\",Data!$U$3:$U$99780,\"\",Data!$W$3:$W$99780,\"<\"&S$6,Data!$W$3:$W$99780,\">=\"&R$6,Data!$X$3:$X$99780,\"<>2\",Data!$AE$3:$AE$99780,TRUE)","v":0},{"$f":"COUNTIFS(Data!$P$3:$P$99780,\"<>\",Data!$Q$3:$Q$99780,\"\",Data!$R$3:$R$99780,\"\",Data!$S$3:$S$99780,\"\",Data!$U$3:$U$99780,\"\",Data!$W$3:$W$99780,\"<\"&T$6,Data!$W$3:$W$99780,\">=\"&S$6,Data!$X$3:$X$99780,\"<>2\",Data!$AE$3:$AE$99780,TRUE)","v":0},{"$f":"COUNTIFS(Data!$P$3:$P$99780,\"<>\",Data!$Q$3:$Q$99780,\"\",Data!$R$3:$R$99780,\"\",Data!$S$3:$S$99780,\"\",Data!$U$3:$U$99780,\"\",Data!$W$3:$W$99780,\"<\"&U$6,Data!$W$3:$W$99780,\">=\"&T$6,Data!$X$3:$X$99780,\"<>2\",Data!$AE$3:$AE$99780,TRUE)","v":0},{"$f":"COUNTIFS(Data!$P$3:$P$99780,\"<>\",Data!$Q$3:$Q$99780,\"\",Data!$R$3:$R$99780,\"\",Data!$S$3:$S$99780,\"\",Data!$U$3:$U$99780,\"\",Data!$W$3:$W$99780,\"<\"&V$6,Data!$W$3:$W$99780,\">=\"&U$6,Data!$X$3:$X$99780,\"<>2\",Data!$AE$3:$AE$99780,TRUE)","v":0},{"$f":"COUNTIFS(Data!$P$3:$P$99780,\"<>\",Data!$Q$3:$Q$99780,\"\",Data!$R$3:$R$99780,\"\",Data!$S$3:$S$99780,\"\",Data!$U$3:$U$99780,\"\",Data!$W$3:$W$99780,\"<\"&W$6,Data!$W$3:$W$99780,\">=\"&V$6,Data!$X$3:$X$99780,\"<>2\",Data!$AE$3:$AE$99780,TRUE)","v":0},{"$f":"COUNTIFS(Data!$P$3:$P$99780,\"<>\",Data!$Q$3:$Q$99780,\"\",Data!$R$3:$R$99780,\"\",Data!$S$3:$S$99780,\"\",Data!$U$3:$U$99780,\"\",Data!$W$3:$W$99780,\"<\"&X$6,Data!$W$3:$W$99780,\">=\"&W$6,Data!$X$3:$X$99780,\"<>2\",Data!$AE$3:$AE$99780,TRUE)","v":0},{"$f":"COUNTIFS(Data!$P$3:$P$99780,\"<>\",Data!$Q$3:$Q$99780,\"\",Data!$R$3:$R$99780,\"\",Data!$S$3:$S$99780,\"\",Data!$U$3:$U$99780,\"\",Data!$W$3:$W$99780,\"<\"&Y$6,Data!$W$3:$W$99780,\">=\"&X$6,Data!$X$3:$X$99780,\"<>2\",Data!$AE$3:$AE$99780,TRUE)","v":0},{"$f":"COUNTIFS(Data!$P$3:$P$99780,\"<>\",Data!$Q$3:$Q$99780,\"\",Data!$R$3:$R$99780,\"\",Data!$S$3:$S$99780,\"\",Data!$U$3:$U$99780,\"\",Data!$W$3:$W$99780,\"<\"&Z$6,Data!$W$3:$W$99780,\">=\"&Y$6,Data!$X$3:$X$99780,\"<>2\",Data!$AE$3:$AE$99780,TRUE)","v":0},{"$f":"COUNTIFS(Data!$P$3:$P$99780,\"<>\",Data!$Q$3:$Q$99780,\"\",Data!$R$3:$R$99780,\"\",Data!$S$3:$S$99780,\"\",Data!$U$3:$U$99780,\"\",Data!$W$3:$W$99780,\"<\"&AA$6,Data!$W$3:$W$99780,\">=\"&Z$6,Data!$X$3:$X$99780,\"<>2\",Data!$AE$3:$AE$99780,TRUE)","v":0},{"$f":"COUNTIFS(Data!$P$3:$P$99780,\"<>\",Data!$Q$3:$Q$99780,\"\",Data!$R$3:$R$99780,\"\",Data!$S$3:$S$99780,\"\",Data!$U$3:$U$99780,\"\",Data!$W$3:$W$99780,\"<\"&AB$6,Data!$W$3:$W$99780,\">=\"&AA$6,Data!$X$3:$X$99780,\"<>2\",Data!$AE$3:$AE$99780,TRUE)","v":0},{"$f":"COUNTIFS(Data!$P$3:$P$99780,\"<>\",Data!$Q$3:$Q$99780,\"\",Data!$R$3:$R$99780,\"\",Data!$S$3:$S$99780,\"\",Data!$U$3:$U$99780,\"\",Data!$W$3:$W$99780,\"<\"&AC$6,Data!$W$3:$W$99780,\">=\"&AB$6,Data!$X$3:$X$99780,\"<>2\",Data!$AE$3:$AE$99780,TRUE)","v":0},{"$f":"COUNTIFS(Data!$P$3:$P$99780,\"<>\",Data!$Q$3:$Q$99780,\"\",Data!$R$3:$R$99780,\"\",Data!$S$3:$S$99780,\"\",Data!$U$3:$U$99780,\"\",Data!$W$3:$W$99780,\"<\"&AD$6,Data!$W$3:$W$99780,\">=\"&AC$6,Data!$X$3:$X$99780,\"<>2\",Data!$AE$3:$AE$99780,TRUE)","v":0},{"$f":"COUNTIFS(Data!$P$3:$P$99780,\"<>\",Data!$Q$3:$Q$99780,\"\",Data!$R$3:$R$99780,\"\",Data!$S$3:$S$99780,\"\",Data!$U$3:$U$99780,\"\",Data!$W$3:$W$99780,\"<\"&AE$6,Data!$W$3:$W$99780,\">=\"&AD$6,Data!$X$3:$X$99780,\"<>2\",Data!$AE$3:$AE$99780,TRUE)","v":0},{"$f":"COUNTIFS(Data!$P$3:$P$99780,\"<>\",Data!$Q$3:$Q$99780,\"\",Data!$R$3:$R$99780,\"\",Data!$S$3:$S$99780,\"\",Data!$U$3:$U$99780,\"\",Data!$W$3:$W$99780,\"<\"&AF$6,Data!$W$3:$W$99780,\">=\"&AE$6,Data!$X$3:$X$99780,\"<>2\",Data!$AE$3:$AE$99780,TRUE)","v":0},{"$f":"COUNTIFS(Data!$P$3:$P$99780,\"<>\",Data!$Q$3:$Q$99780,\"\",Data!$R$3:$R$99780,\"\",Data!$S$3:$S$99780,\"\",Data!$U$3:$U$99780,\"\",Data!$W$3:$W$99780,\"<\"&AG$6,Data!$W$3:$W$99780,\">=\"&AF$6,Data!$X$3:$X$99780,\"<>2\",Data!$AE$3:$AE$99780,TRUE)","v":0},{"$f":"COUNTIFS(Data!$P$3:$P$99780,\"<>\",Data!$Q$3:$Q$99780,\"\",Data!$R$3:$R$99780,\"\",Data!$S$3:$S$99780,\"\",Data!$U$3:$U$99780,\"\",Data!$W$3:$W$99780,\"<\"&AH$6,Data!$W$3:$W$99780,\">=\"&AG$6,Data!$X$3:$X$99780,\"<>2\",Data!$AE$3:$AE$99780,TRUE)","v":0},{"$f":"COUNTIFS(Data!$P$3:$P$99780,\"<>\",Data!$Q$3:$Q$99780,\"\",Data!$R$3:$R$99780,\"\",Data!$S$3:$S$99780,\"\",Data!$U$3:$U$99780,\"\",Data!$W$3:$W$99780,\"<\"&AI$6,Data!$W$3:$W$99780,\">=\"&AH$6,Data!$X$3:$X$99780,\"<>2\",Data!$AE$3:$AE$99780,TRUE)","v":0},{"$f":"COUNTIFS(Data!$P$3:$P$99780,\"<>\",Data!$Q$3:$Q$99780,\"\",Data!$R$3:$R$99780,\"\",Data!$S$3:$S$99780,\"\",Data!$U$3:$U$99780,\"\",Data!$W$3:$W$99780,\"<\"&AJ$6,Data!$W$3:$W$99780,\">=\"&AI$6,Data!$X$3:$X$99780,\"<>2\",Data!$AE$3:$AE$99780,TRUE)","v":0},{"$f":"COUNTIFS(Data!$P$3:$P$99780,\"<>\",Data!$Q$3:$Q$99780,\"\",Data!$R$3:$R$99780,\"\",Data!$S$3:$S$99780,\"\",Data!$U$3:$U$99780,\"\",Data!$W$3:$W$99780,\"<\"&AK$6,Data!$W$3:$W$99780,\">=\"&AJ$6,Data!$X$3:$X$99780,\"<>2\",Data!$AE$3:$AE$99780,TRUE)","v":0},{"$f":"COUNTIFS(Data!$P$3:$P$99780,\"<>\",Data!$Q$3:$Q$99780,\"\",Data!$R$3:$R$99780,\"\",Data!$S$3:$S$99780,\"\",Data!$U$3:$U$99780,\"\",Data!$W$3:$W$99780,\"<\"&AL$6,Data!$W$3:$W$99780,\">=\"&AK$6,Data!$X$3:$X$99780,\"<>2\",Data!$AE$3:$AE$99780,TRUE)","v":0},{"$f":"COUNTIFS(Data!$P$3:$P$99780,\"<>\",Data!$Q$3:$Q$99780,\"\",Data!$R$3:$R$99780,\"\",Data!$S$3:$S$99780,\"\",Data!$U$3:$U$99780,\"\",Data!$W$3:$W$99780,\"<\"&AM$6,Data!$W$3:$W$99780,\">=\"&AL$6,Data!$X$3:$X$99780,\"<>2\",Data!$AE$3:$AE$99780,TRUE)","v":0},{"$f":"COUNTIFS(Data!$P$3:$P$99780,\"<>\",Data!$Q$3:$Q$99780,\"\",Data!$R$3:$R$99780,\"\",Data!$S$3:$S$99780,\"\",Data!$U$3:$U$99780,\"\",Data!$W$3:$W$99780,\"<\"&AN$6,Data!$W$3:$W$99780,\">=\"&AM$6,Data!$X$3:$X$99780,\"<>2\",Data!$AE$3:$AE$99780,TRUE)","v":0},{"$f":"COUNTIFS(Data!$P$3:$P$99780,\"<>\",Data!$Q$3:$Q$99780,\"\",Data!$R$3:$R$99780,\"\",Data!$S$3:$S$99780,\"\",Data!$U$3:$U$99780,\"\",Data!$W$3:$W$99780,\"<\"&AO$6,Data!$W$3:$W$99780,\">=\"&AN$6,Data!$X$3:$X$99780,\"<>2\",Data!$AE$3:$AE$99780,TRUE)","v":0},{"$f":"COUNTIFS(Data!$P$3:$P$99780,\"<>\",Data!$Q$3:$Q$99780,\"\",Data!$R$3:$R$99780,\"\",Data!$S$3:$S$99780,\"\",Data!$U$3:$U$99780,\"\",Data!$W$3:$W$99780,\"<\"&AP$6,Data!$W$3:$W$99780,\">=\"&AO$6,Data!$X$3:$X$99780,\"<>2\",Data!$AE$3:$AE$99780,TRUE)","v":0},{"$f":"COUNTIFS(Data!$P$3:$P$99780,\"<>\",Data!$Q$3:$Q$99780,\"\",Data!$R$3:$R$99780,\"\",Data!$S$3:$S$99780,\"\",Data!$U$3:$U$99780,\"\",Data!$W$3:$W$99780,\"<\"&AQ$6,Data!$W$3:$W$99780,\">=\"&AP$6,Data!$X$3:$X$99780,\"<>2\",Data!$AE$3:$AE$99780,TRUE)","v":0},{"$f":"COUNTIFS(Data!$P$3:$P$99780,\"<>\",Data!$Q$3:$Q$99780,\"\",Data!$R$3:$R$99780,\"\",Data!$S$3:$S$99780,\"\",Data!$U$3:$U$99780,\"\",Data!$W$3:$W$99780,\"<\"&AR$6,Data!$W$3:$W$99780,\">=\"&AQ$6,Data!$X$3:$X$99780,\"<>2\",Data!$AE$3:$AE$99780,TRUE)","v":0},{"$f":"COUNTIFS(Data!$P$3:$P$99780,\"<>\",Data!$Q$3:$Q$99780,\"\",Data!$R$3:$R$99780,\"\",Data!$S$3:$S$99780,\"\",Data!$U$3:$U$99780,\"\",Data!$W$3:$W$99780,\"<\"&AS$6,Data!$W$3:$W$99780,\">=\"&AR$6,Data!$X$3:$X$99780,\"<>2\",Data!$AE$3:$AE$99780,TRUE)","v":0},{"$f":"COUNTIFS(Data!$P$3:$P$99780,\"<>\",Data!$Q$3:$Q$99780,\"\",Data!$R$3:$R$99780,\"\",Data!$S$3:$S$99780,\"\",Data!$U$3:$U$99780,\"\",Data!$W$3:$W$99780,\"<\"&AT$6,Data!$W$3:$W$99780,\">=\"&AS$6,Data!$X$3:$X$99780,\"<>2\",Data!$AE$3:$AE$99780,TRUE)","v":0},{"$f":"COUNTIFS(Data!$P$3:$P$99780,\"<>\",Data!$Q$3:$Q$99780,\"\",Data!$R$3:$R$99780,\"\",Data!$S$3:$S$99780,\"\",Data!$U$3:$U$99780,\"\",Data!$W$3:$W$99780,\"<\"&AU$6,Data!$W$3:$W$99780,\">=\"&AT$6,Data!$X$3:$X$99780,\"<>2\",Data!$AE$3:$AE$99780,TRUE)","v":0},{"$f":"COUNTIFS(Data!$P$3:$P$99780,\"<>\",Data!$Q$3:$Q$99780,\"\",Data!$R$3:$R$99780,\"\",Data!$S$3:$S$99780,\"\",Data!$U$3:$U$99780,\"\",Data!$W$3:$W$99780,\"<\"&AV$6,Data!$W$3:$W$99780,\">=\"&AU$6,Data!$X$3:$X$99780,\"<>2\",Data!$AE$3:$AE$99780,TRUE)","v":0},{"$f":"COUNTIFS(Data!$P$3:$P$99780,\"<>\",Data!$Q$3:$Q$99780,\"\",Data!$R$3:$R$99780,\"\",Data!$S$3:$S$99780,\"\",Data!$U$3:$U$99780,\"\",Data!$W$3:$W$99780,\"<\"&AW$6,Data!$W$3:$W$99780,\">=\"&AV$6,Data!$X$3:$X$99780,\"<>2\",Data!$AE$3:$AE$99780,TRUE)","v":0},{"$f":"COUNTIFS(Data!$P$3:$P$99780,\"<>\",Data!$Q$3:$Q$99780,\"\",Data!$R$3:$R$99780,\"\",Data!$S$3:$S$99780,\"\",Data!$U$3:$U$99780,\"\",Data!$W$3:$W$99780,\"<\"&AX$6,Data!$W$3:$W$99780,\">=\"&AW$6,Data!$X$3:$X$99780,\"<>2\",Data!$AE$3:$AE$99780,TRUE)","v":0}]
["S1 refusal/withdrawal",{"$f":"COUNTIFS(Data!$N$3:$N$99780,\"<>\",Data!$O$3:$O$99780,\"\",Data!$P$3:$P$99780,\"\",Data!$Q$3:$Q$99780,\"\",Data!$R$3:$R$99780,\"\",Data!$S$3:$S$99780,\"\",Data!$U$3:$U$99780,\"\",Data!$W$3:$W$99780,\"<\"&C$6,Data!$W$3:$W$99780,\">=\"&B$6,Data!$X$3:$X$99780,\"<>2\",Data!$AE$3:$AE$99780,TRUE)","v":0},{"$f":"COUNTIFS(Data!$N$3:$N$99780,\"<>\",Data!$O$3:$O$99780,\"\",Data!$P$3:$P$99780,\"\",Data!$Q$3:$Q$99780,\"\",Data!$R$3:$R$99780,\"\",Data!$S$3:$S$99780,\"\",Data!$U$3:$U$99780,\"\",Data!$W$3:$W$99780,\"<\"&D$6,Data!$W$3:$W$99780,\">=\"&C$6,Data!$X$3:$X$99780,\"<>2\",Data!$AE$3:$AE$99780,TRUE)","v":0},{"$f":"COUNTIFS(Data!$N$3:$N$99780,\"<>\",Data!$O$3:$O$99780,\"\",Data!$P$3:$P$99780,\"\",Data!$Q$3:$Q$99780,\"\",Data!$R$3:$R$99780,\"\",Data!$S$3:$S$99780,\"\",Data!$U$3:$U$99780,\"\",Data!$W$3:$W$99780,\"<\"&E$6,Data!$W$3:$W$99780,\">=\"&D$6,Data!$X$3:$X$99780,\"<>2\",Data!$AE$3:$AE$99780,TRUE)","v":0},{"$f":"COUNTIFS(Data!$N$3:$N$99780,\"<>\",Data!$O$3:$O$99780,\"\",Data!$P$3:$P$99780,\"\",Data!$Q$3:$Q$99780,\"\",Data!$R$3:$R$99780,\"\",Data!$S$3:$S$99780,\"\",Data!$U$3:$U$99780,\"\",Data!$W$3:$W$99780,\"<\"&F$6,Data!$W$3:$W$99780,\">=\"&E$6,Data!$X$3:$X$99780,\"<>2\",Data!$AE$3:$AE$99780,TRUE)","v":0},{"$f":"COUNTIFS(Data!$N$3:$N$99780,\"<>\",Data!$O$3:$O$99780,\"\",Data!$P$3:$P$99780,\"\",Data!$Q$3:$Q$99780,\"\",Data!$R$3:$R$99780,\"\",Data!$S$3:$S$99780,\"\",Data!$U$3:$U$99780,\"\",Data!$W$3:$W$99780,\"<\"&G$6,Data!$W$3:$W$99780,\">=\"&F$6,Data!$X$3:$X$99780,\"<>2\",Data!$AE$3:$AE$99780,TRUE)","v":0},{"$f":"COUNTIFS(Data!$N$3:$N$99780,\"<>\",Data!$O$3:$O$99780,\"\",Data!$P$3:$P$99780,\"\",Data!$Q$3:$Q$99780,\"\",Data!$R$3:$R$99780,\"\",Data!$S$3:$S$99780,\"\",Data!$U$3:$U$99780,\"\",Data!$W$3:$W$99780,\"<\"&H$6,Data!$W$3:$W$99780,\">=\"&G$6,Data!$X$3:$X$99780,\"<>2\",Data!$AE$3:$AE$99780,TRUE)","v":0},{"$f":"COUNTIFS(Data!$N$3:$N$99780,\"<>\",Data!$O$3:$O$99780,\"\",Data!$P$3:$P$99780,\"\",Data!$Q$3:$Q$99780,\"\",Data!$R$3:$R$99780,\"\",Data!$S$3:$S$99780,\"\",Data!$U$3:$U$99780,\"\",Data!$W$3:$W$99780,\"<\"&I$6,Data!$W$3:$W$99780,\">=\"&H$6,Data!$X$3:$X$99780,\"<>2\",Data!$AE$3:$AE$99780,TRUE)","v":0},{"$f":"COUNTIFS(Data!$N$3:$N$99780,\"<>\",Data!$O$3:$O$99780,\"\",Data!$P$3:$P$99780,\"\",Data!$Q$3:$Q$99780,\"\",Data!$R$3:$R$99780,\"\",Data!$S$3:$S$99780,\"\",Data!$U$3:$U$99780,\"\",Data!$W$3:$W$99780,\"<\"&J$6,Data!$W$3:$W$99780,\">=\"&I$6,Data!$X$3:$X$99780,\"<>2\",Data!$AE$3:$AE$99780,TRUE)","v":0},{"$f":"COUNTIFS(Data!$N$3:$N$99780,\"<>\",Data!$O$3:$O$99780,\"\",Data!$P$3:$P$99780,\"\",Data!$Q$3:$Q$99780,\"\",Data!$R$3:$R$99780,\"\",Data!$S$3:$S$99780,\"\",Data!$U$3:$U$99780,\"\",Data!$W$3:$W$99780,\"<\"&K$6,Data!$W$3:$W$99780,\">=\"&J$6,Data!$X$3:$X$99780,\"<>2\",Data!$AE$3:$AE$99780,TRUE)","v":0},{"$f":"COUNTIFS(Data!$N$3:$N$99780,\"<>\",Data!$O$3:$O$99780,\"\",Data!$P$3:$P$99780,\"\",Data!$Q$3:$Q$99780,\"\",Data!$R$3:$R$99780,\"\",Data!$S$3:$S$99780,\"\",Data!$U$3:$U$99780,\"\",Data!$W$3:$W$99780,\"<\"&L$6,Data!$W$3:$W$99780,\">=\"&K$6,Data!$X$3:$X$99780,\"<>2\",Data!$AE$3:$AE$99780,TRUE)","v":0},{"$f":"COUNTIFS(Data!$N$3:$N$99780,\"<>\",Data!$O$3:$O$99780,\"\",Data!$P$3:$P$99780,\"\",Data!$Q$3:$Q$99780,\"\",Data!$R$3:$R$99780,\"\",Data!$S$3:$S$99780,\"\",Data!$U$3:$U$99780,\"\",Data!$W$3:$W$99780,\"<\"&M$6,Data!$W$3:$W$99780,\">=\"&L$6,Data!$X$3:$X$99780,\"<>2\",Data!$AE$3:$AE$99780,TRUE)","v":0},{"$f":"COUNTIFS(Data!$N$3:$N$99780,\"<>\",Data!$O$3:$O$99780,\"\",Data!$P$3:$P$99780,\"\",Data!$Q$3:$Q$99780,\"\",Data!$R$3:$R$99780,\"\",Data!$S$3:$S$99780,\"\",Data!$U$3:$U$99780,\"\",Data!$W$3:$W$99780,\"<\"&N$6,Data!$W$3:$W$99780,\">=\"&M$6,Data!$X$3:$X$99780,\"<>2\",Data!$AE$3:$AE$99780,TRUE)","v":0},{"$f":"COUNTIFS(Data!$N$3:$N$99780,\"<>\",Data!$O$3:$O$99780,\"\",Data!$P$3:$P$99780,\"\",Data!$Q$3:$Q$99780,\"\",Data!$R$3:$R$99780,\"\",Data!$S$3:$S$99780,\"\",Data!$U$3:$U$99780,\"\",Data!$W$3:$W$99780,\"<\"&O$6,Data!$W$3:$W$99780,\">=\"&N$6,Data!$X$3:$X$99780,\"<>2\",Data!$AE$3:$AE$99780,TRUE)","v":0},{"$f":"COUNTIFS(Data!$N$3:$N$99780,\"<>\",Data!$O$3:$O$99780,\"\",Data!$P$3:$P$99780,\"\",Data!$Q$3:$Q$99780,\"\",Data!$R$3:$R$99780,\"\",Data!$S$3:$S$99780,\"\",Data!$U$3:$U$99780,\"\",Data!$W$3:$W$99780,\"<\"&P$6,Data!$W$3:$W$99780,\">=\"&O$6,Data!$X$3:$X$99780,\"<>2\",Data!$AE$3:$AE$99780,TRUE)","v":0},{"$f":"COUNTIFS(Data!$N$3:$N$99780,\"<>\",Data!$O$3:$O$99780,\"\",Data!$P$3:$P$99780,\"\",Data!$Q$3:$Q$99780,\"\",Data!$R$3:$R$99780,\"\",Data!$S$3:$S$99780,\"\",Data!$U$3:$U$99780,\"\",Data!$W$3:$W$99780,\"<\"&Q$6,Data!$W$3:$W$99780,\">=\"&P$6,Data!$X$3:$X$99780,\"<>2\",Data!$AE$3:$AE$99780,TRUE)","v":0},{"$f":"COUNTIFS(Data!$N$3:$N$99780,\"<>\",Data!$O$3:$O$99780,\"\",Data!$P$3:$P$99780,\"\",Data!$Q$3:$Q$99780,\"\",Data!$R$3:$R$99780,\"\",Data!$S$3:$S$99780,\"\",Data!$U$3:$U$99780,\"\",Data!$W$3:$W$99780,\"<\"&R$6,Data!$W$3:$W$99780,\">=\"&Q$6,Data!$X$3:$X$99780,\"<>2\",Data!$AE$3:$AE$99780,TRUE)","v":0},{"$f":"COUNTIFS(Data!$N$3:$N$99780,\"<>\",Data!$O$3:$O$99780,\"\",Data!$P$3:$P$99780,\"\",Data!$Q$3:$Q$99780,\"\",Data!$R$3:$R$99780,\"\",Data!$S$3:$S$99780,\"\",Data!$U$3:$U$99780,\"\",Data!$W$3:$W$99780,\"<\"&S$6,Data!$W$3:$W$99780,\">=\"&R$6,Data!$X$3:$X$99780,\"<>2\",Data!$AE$3:$AE$99780,TRUE)","v":0},{"$f":"COUNTIFS(Data!$N$3:$N$99780,\"<>\",Data!$O$3:$O$99780,\"\",Data!$P$3:$P$99780,\"\",Data!$Q$3:$Q$99780,\"\",Data!$R$3:$R$99780,\"\",Data!$S$3:$S$99780,\"\",Data!$U$3:$U$99780,\"\",Data!$W$3:$W$99780,\"<\"&T$6,Data!$W$3:$W$99780,\">=\"&S$6,Data!$X$3:$X$99780,\"<>2\",Data!$AE$3:$AE$99780,TRUE)","v":0},{"$f":"COUNTIFS(Data!$N$3:$N$99780,\"<>\",Data!$O$3:$O$99780,\"\",Data!$P$3:$P$99780,\"\",Data!$Q$3:$Q$99780,\"\",Data!$R$3:$R$99780,\"\",Data!$S$3:$S$99780,\"\",Data!$U$3:$U$99780,\"\",Data!$W$3:$W$99780,\"<\"&U$6,Data!$W$3:$W$99780,\">=\"&T$6,Data!$X$3:$X$99780,\"<>2\",Data!$AE$3:$AE$99780,TRUE)","v":0},{"$f":"COUNTIFS(Data!$N$3:$N$99780,\"<>\",Data!$O$3:$O$99780,\"\",Data!$P$3:$P$99780,\"\",Data!$Q$3:$Q$99780,\"\",Data!$R$3:$R$99780,\"\",Data!$S$3:$S$99780,\"\",Data!$U$3:$U$99780,\"\",Data!$W$3:$W$99780,\"<\"&V$6,Data!$W$3:$W$99780,\">=\"&U$6,Data!$X$3:$X$99780,\"<>2\",Data!$AE$3:$AE$99780,TRUE)","v":0},{"$f":"COUNTIFS(Data!$N$3:$N$99780,\"<>\",Data!$O$3:$O$99780,\"\",Data!$P$3:$P$99780,\"\",Data!$Q$3:$Q$99780,\"\",Data!$R$3:$R$99780,\"\",Data!$S$3:$S$99780,\"\",Data!$U$3:$U$99780,\"\",Data!$W$3:$W$99780,\"<\"&W$6,Data!$W$3:$W$99780,\">=\"&V$6,Data!$X$3:$X$99780,\"<>2\",Data!$AE$3:$AE$99780,TRUE)","v":0},{"$f":"COUNTIFS(Data!$N$3:$N$99780,\"<>\",Data!$O$3:$O$99780,\"\",Data!$P$3:$P$99780,\"\",Data!$Q$3:$Q$99780,\"\",Data!$R$3:$R$99780,\"\",Data!$S$3:$S$99780,\"\",Data!$U$3:$U$99780,\"\",Data!$W$3:$W$99780,\"<\"&X$6,Data!$W$3:$W$99780,\">=\"&W$6,Data!$X$3:$X$99780,\"<>2\",Data!$AE$3:$AE$99780,TRUE)","v":0},{"$f":"COUNTIFS(Data!$N$3:$N$99780,\"<>\",Data!$O$3:$O$99780,\"\",Data!$P$3:$P$99780,\"\",Data!$Q$3:$Q$99780,\"\",Data!$R$3:$R$99780,\"\",Data!$S$3:$S$99780,\"\",Data!$U$3:$U$99780,\"\",Data!$W$3:$W$99780,\"<\"&Y$6,Data!$W$3:$W$99780,\">=\"&X$6,Data!$X$3:$X$99780,\"<>2\",Data!$AE$3:$AE$99780,TRUE)","v":0},{"$f":"COUNTIFS(Data!$N$3:$N$99780,\"<>\",Data!$O$3:$O$99780,\"\",Data!$P$3:$P$99780,\"\",Data!$Q$3:$Q$99780,\"\",Data!$R$3:$R$99780,\"\",Data!$S$3:$S$99780,\"\",Data!$U$3:$U$99780,\"\",Data!$W$3:$W$99780,\"<\"&Z$6,Data!$W$3:$W$99780,\">=\"&Y$6,Data!$X$3:$X$99780,\"<>2\",Data!$AE$3:$AE$99780,TRUE)","v":0},{"$f":"COUNTIFS(Data!$N$3:$N$99780,\"<>\",Data!$O$3:$O$99780,\"\",Data!$P$3:$P$99780,\"\",Data!$Q$3:$Q$99780,\"\",Data!$R$3:$R$99780,\"\",Data!$S$3:$S$99780,\"\",Data!$U$3:$U$99780,\"\",Data!$W$3:$W$99780,\"<\"&AA$6,Data!$W$3:$W$99780,\">=\"&Z$6,Data!$X$3:$X$99780,\"<>2\",Data!$AE$3:$AE$99780,TRUE)","v":0},{"$f":"COUNTIFS(Data!$N$3:$N$99780,\"<>\",Data!$O$3:$O$99780,\"\",Data!$P$3:$P$99780,\"\",Data!$Q$3:$Q$99780,\"\",Data!$R$3:$R$99780,\"\",Data!$S$3:$S$99780,\"\",Data!$U$3:$U$99780,\"\",Data!$W$3:$W$99780,\"<\"&AB$6,Data!$W$3:$W$99780,\">=\"&AA$6,Data!$X$3:$X$99780,\"<>2\",Data!$AE$3:$AE$99780,TRUE)","v":0},{"$f":"COUNTIFS(Data!$N$3:$N$99780,\"<>\",Data!$O$3:$O$99780,\"\",Data!$P$3:$P$99780,\"\",Data!$Q$3:$Q$99780,\"\",Data!$R$3:$R$99780,\"\",Data!$S$3:$S$99780,\"\",Data!$U$3:$U$99780,\"\",Data!$W$3:$W$99780,\"<\"&AC$6,Data!$W$3:$W$99780,\">=\"&AB$6,Data!$X$3:$X$99780,\"<>2\",Data!$AE$3:$AE$99780,TRUE)","v":0},{"$f":"COUNTIFS(Data!$N$3:$N$99780,\"<>\",Data!$O$3:$O$99780,\"\",Data!$P$3:$P$99780,\"\",Data!$Q$3:$Q$99780,\"\",Data!$R$3:$R$99780,\"\",Data!$S$3:$S$99780,\"\",Data!$U$3:$U$99780,\"\",Data!$W$3:$W$99780,\"<\"&AD$6,Data!$W$3:$W$99780,\">=\"&AC$6,Data!$X$3:$X$99780,\"<>2\",Data!$AE$3:$AE$99780,TRUE)","v":0},{"$f":"COUNTIFS(Data!$N$3:$N$99780,\"<>\",Data!$O$3:$O$99780,\"\",Data!$P$3:$P$99780,\"\",Data!$Q$3:$Q$99780,\"\",Data!$R$3:$R$99780,\"\",Data!$S$3:$S$99780,\"\",Data!$U$3:$U$99780,\"\",Data!$W$3:$W$99780,\"<\"&AE$6,Data!$W$3:$W$99780,\">=\"&AD$6,Data!$X$3:$X$99780,\"<>2\",Data!$AE$3:$AE$99780,TRUE)","v":0},{"$f":"COUNTIFS(Data!$N$3:$N$99780,\"<>\",Data!$O$3:$O$99780,\"\",Data!$P$3:$P$99780,\"\",Data!$Q$3:$Q$99780,\"\",Data!$R$3:$R$99780,\"\",Data!$S$3:$S$99780,\"\",Data!$U$3:$U$99780,\"\",Data!$W$3:$W$99780,\"<\"&AF$6,Data!$W$3:$W$99780,\">=\"&AE$6,Data!$X$3:$X$99780,\"<>2\",Data!$AE$3:$AE$99780,TRUE)","v":0},{"$f":"COUNTIFS(Data!$N$3:$N$99780,\"<>\",Data!$O$3:$O$99780,\"\",Data!$P$3:$P$99780,\"\",Data!$Q$3:$Q$99780,\"\",Data!$R$3:$R$99780,\"\",Data!$S$3:$S$99780,\"\",Data!$U$3:$U$99780,\"\",Data!$W$3:$W$99780,\"<\"&AG$6,Data!$W$3:$W$99780,\">=\"&AF$6,Data!$X$3:$X$99780,\"<>2\",Data!$AE$3:$AE$99780,TRUE)","v":0},{"$f":"COUNTIFS(Data!$N$3:$N$99780,\"<>\",Data!$O$3:$O$99780,\"\",Data!$P$3:$P$99780,\"\",Data!$Q$3:$Q$99780,\"\",Data!$R$3:$R$99780,\"\",Data!$S$3:$S$99780,\"\",Data!$U$3:$U$99780,\"\",Data!$W$3:$W$99780,\"<\"&AH$6,Data!$W$3:$W$99780,\">=\"&AG$6,Data!$X$3:$X$99780,\"<>2\",Data!$AE$3:$AE$99780,TRUE)","v":0},{"$f":"COUNTIFS(Data!$N$3:$N$99780,\"<>\",Data!$O$3:$O$99780,\"\",Data!$P$3:$P$99780,\"\",Data!$Q$3:$Q$99780,\"\",Data!$R$3:$R$99780,\"\",Data!$S$3:$S$99780,\"\",Data!$U$3:$U$99780,\"\",Data!$W$3:$W$99780,\"<\"&AI$6,Data!$W$3:$W$99780,\">=\"&AH$6,Data!$X$3:$X$99780,\"<>2\",Data!$AE$3:$AE$99780,TRUE)","v":0},{"$f":"COUNTIFS(Data!$N$3:$N$99780,\"<>\",Data!$O$3:$O$99780,\"\",Data!$P$3:$P$99780,\"\",Data!$Q$3:$Q$99780,\"\",Data!$R$3:$R$99780,\"\",Data!$S$3:$S$99780,\"\",Data!$U$3:$U$99780,\"\",Data!$W$3:$W$99780,\"<\"&AJ$6,Data!$W$3:$W$99780,\">=\"&AI$6,Data!$X$3:$X$99780,\"<>2\",Data!$AE$3:$AE$99780,TRUE)","v":0},{"$f":"COUNTIFS(Data!$N$3:$N$99780,\"<>\",Data!$O$3:$O$99780,\"\",Data!$P$3:$P$99780,\"\",Data!$Q$3:$Q$99780,\"\",Data!$R$3:$R$99780,\"\",Data!$S$3:$S$99780,\"\",Data!$U$3:$U$99780,\"\",Data!$W$3:$W$99780,\"<\"&AK$6,Data!$W$3:$W$99780,\">=\"&AJ$6,Data!$X$3:$X$99780,\"<>2\",Data!$AE$3:$AE$99780,TRUE)","v":0},{"$f":"COUNTIFS(Data!$N$3:$N$99780,\"<>\",Data!$O$3:$O$99780,\"\",Data!$P$3:$P$99780,\"\",Data!$Q$3:$Q$99780,\"\",Data!$R$3:$R$99780,\"\",Data!$S$3:$S$99780,\"\",Data!$U$3:$U$99780,\"\",Data!$W$3:$W$99780,\"<\"&AL$6,Data!$W$3:$W$99780,\">=\"&AK$6,Data!$X$3:$X$99780,\"<>2\",Data!$AE$3:$AE$99780,TRUE)","v":0},{"$f":"COUNTIFS(Data!$N$3:$N$99780,\"<>\",Data!$O$3:$O$99780,\"\",Data!$P$3:$P$99780,\"\",Data!$Q$3:$Q$99780,\"\",Data!$R$3:$R$99780,\"\",Data!$S$3:$S$99780,\"\",Data!$U$3:$U$99780,\"\",Data!$W$3:$W$99780,\"<\"&AM$6,Data!$W$3:$W$99780,\">=\"&AL$6,Data!$X$3:$X$99780,\"<>2\",Data!$AE$3:$AE$99780,TRUE)","v":0},{"$f":"COUNTIFS(Data!$N$3:$N$99780,\"<>\",Data!$O$3:$O$99780,\"\",Data!$P$3:$P$99780,\"\",Data!$Q$3:$Q$99780,\"\",Data!$R$3:$R$99780,\"\",Data!$S$3:$S$99780,\"\",Data!$U$3:$U$99780,\"\",Data!$W$3:$W$99780,\"<\"&AN$6,Data!$W$3:$W$99780,\">=\"&AM$6,Data!$X$3:$X$99780,\"<>2\",Data!$AE$3:$AE$99780,TRUE)","v":0},{"$f":"COUNTIFS(Data!$N$3:$N$99780,\"<>\",Data!$O$3:$O$99780,\"\",Data!$P$3:$P$99780,\"\",Data!$Q$3:$Q$99780,\"\",Data!$R$3:$R$99780,\"\",Data!$S$3:$S$99780,\"\",Data!$U$3:$U$99780,\"\",Data!$W$3:$W$99780,\"<\"&AO$6,Data!$W$3:$W$99780,\">=\"&AN$6,Data!$X$3:$X$99780,\"<>2\",Data!$AE$3:$AE$99780,TRUE)","v":0},{"$f":"COUNTIFS(Data!$N$3:$N$99780,\"<>\",Data!$O$3:$O$99780,\"\",Data!$P$3:$P$99780,\"\",Data!$Q$3:$Q$99780,\"\",Data!$R$3:$R$99780,\"\",Data!$S$3:$S$99780,\"\",Data!$U$3:$U$99780,\"\",Data!$W$3:$W$99780,\"<\"&AP$6,Data!$W$3:$W$99780,\">=\"&AO$6,Data!$X$3:$X$99780,\"<>2\",Data!$AE$3:$AE$99780,TRUE)","v":0},{"$f":"COUNTIFS(Data!$N$3:$N$99780,\"<>\",Data!$O$3:$O$99780,\"\",Data!$P$3:$P$99780,\"\",Data!$Q$3:$Q$99780,\"\",Data!$R$3:$R$99780,\"\",Data!$S$3:$S$99780,\"\",Data!$U$3:$U$99780,\"\",Data!$W$3:$W$99780,\"<\"&AQ$6,Data!$W$3:$W$99780,\">=\"&AP$6,Data!$X$3:$X$99780,\"<>2\",Data!$AE$3:$AE$99780,TRUE)","v":0},{"$f":"COUNTIFS(Data!$N$3:$N$99780,\"<>\",Data!$O$3:$O$99780,\"\",Data!$P$3:$P$99780,\"\",Data!$Q$3:$Q$99780,\"\",Data!$R$3:$R$99780,\"\",Data!$S$3:$S$99780,\"\",Data!$U$3:$U$99780,\"\",Data!$W$3:$W$99780,\"<\"&AR$6,Data!$W$3:$W$99780,\">=\"&AQ$6,Data!$X$3:$X$99780,\"<>2\",Data!$AE$3:$AE$99780,TRUE)","v":0},{"$f":"COUNTIFS(Data!$N$3:$N$99780,\"<>\",Data!$O$3:$O$99780,\"\",Data!$P$3:$P$99780,\"\",Data!$Q$3:$Q$99780,\"\",Data!$R$3:$R$99780,\"\",Data!$S$3:$S$99780,\"\",Data!$U$3:$U$99780,\"\",Data!$W$3:$W$99780,\"<\"&AS$6,Data!$W$3:$W$99780,\">=\"&AR$6,Data!$X$3:$X$99780,\"<>2\",Data!$AE$3:$AE$99780,TRUE)","v":0},{"$f":"COUNTIFS(Data!$N$3:$N$99780,\"<>\",Data!$O$3:$O$99780,\"\",Data!$P$3:$P$99780,\"\",Data!$Q$3:$Q$99780,\"\",Data!$R$3:$R$99780,\"\",Data!$S$3:$S$99780,\"\",Data!$U$3:$U$99780,\"\",Data!$W$3:$W$99780,\"<\"&AT$6,Data!$W$3:$W$99780,\">=\"&AS$6,Data!$X$3:$X$99780,\"<>2\",Data!$AE$3:$AE$99780,TRUE)","v":0},{"$f":"COUNTIFS(Data!$N$3:$N$99780,\"<>\",Data!$O$3:$O$99780,\"\",Data!$P$3:$P$99780,\"\",Data!$Q$3:$Q$99780,\"\",Data!$R$3:$R$99780,\"\",Data!$S$3:$S$99780,\"\",Data!$U$3:$U$99780,\"\",Data!$W$3:$W$99780,\"<\"&AU$6,Data!$W$3:$W$99780,\">=\"&AT$6,Data!$X$3:$X$99780,\"<>2\",Data!$AE$3:$AE$99780,TRUE)","v":0},{"$f":"COUNTIFS(Data!$N$3:$N$99780,\"<>\",Data!$O$3:$O$99780,\"\",Data!$P$3:$P$99780,\"\",Data!$Q$3:$Q$99780,\"\",Data!$R$3:$R$99780,\"\",Data!$S$3:$S$99780,\"\",Data!$U$3:$U$99780,\"\",Data!$W$3:$W$99780,\"<\"&AV$6,Data!$W$3:$W$99780,\">=\"&AU$6,Data!$X$3:$X$99780,\"<>2\",Data!$AE$3:$AE$99780,TRUE)","v":0},{"$f":"COUNTIFS(Data!$N$3:$N$99780,\"<>\",Data!$O$3:$O$99780,\"\",Data!$P$3:$P$99780,\"\",Data!$Q$3:$Q$99780,\"\",Data!$R$3:$R$99780,\"\",Data!$S$3:$S$99780,\"\",Data!$U$3:$U$99780,\"\",Data!$W$3:$W$99780,\"<\"&AW$6,Data!$W$3:$W$99780,\">=\"&AV$6,Data!$X$3:$X$99780,\"<>2\",Data!$AE$3:$AE$99780,TRUE)","v":0},{"$f":"COUNTIFS(Data!$N$3:$N$99780,\"<>\",Data!$O$3:$O$99780,\"\",Data!$P$3:$P$99780,\"\",Data!$Q$3:$Q$99780,\"\",Data!$R$3:$R$99780,\"\",Data!$S$3:$S$99780,\"\",Data!$U$3:$U$99780,\"\",Data!$W$3:$W$99780,\"<\"&AX$6,Data!$W$3:$W$99780,\">=\"&AW$6,Data!$X$3:$X$99780,\"<>2\",Data!$AE$3:$AE$99780,TRUE)","v":0}]
[]
["QUARTERLY",{"$f":"B6","v":"2022-04-01"},{"$f":"EDATE(B18,3)","v":"2022-07-01"},{"$f":"EDATE(C18,3)","v":"2022-10-01"},"2023-01-01","2023-04-01","2023-07-01","2023-10-01","2024-01-01","2024-04-01","2024-07-01","2024-10-01","2025-01-01","2025-04-01","2025-07-01","2025-10-01","2026-01-01","2026-04-01"]
[null,{"$f":"INDEX(Lists!$S:$S,MATCH(EDATE(B18,3)-1,Lists!$R:$R,0))","v":"2022/23 Q1"},{"$f":"INDEX(Lists!$S:$S,MATCH(EDATE(C18,3)-1,Lists!$R:$R,0))","v":"2022/23 Q2"},{"$f":"INDEX(Lists!$S:$S,MATCH(EDATE(D18,3)-1,Lists!$R:$R,0))","v":"2022/23 Q3"},{"$f":"INDEX(Lists!$S:$S,MATCH(EDATE(E18,3)-1,Lists!$R:$R,0))","v":"2022/23 Q4"},{"$f":"INDEX(Lists!$S:$S,MATCH(EDATE(F18,3)-1,Lists!$R:$R,0))","v":"2023/24 Q1"},{"$f":"INDEX(Lists!$S:$S,MATCH(EDATE(G18,3)-1,Lists!$R:$R,0))","v":"2023/24 Q2"},{"$f":"INDEX(Lists!$S:$S,MATCH(EDATE(H18,3)-1,Lists!$R:$R,0))","v":"2023/24 Q3"},{"$f":"INDEX(Lists!$S:$S,MATCH(EDATE(I18,3)-1,Lists!$R:$R,0))","v":"2023/24 Q4"},{"$f":"INDEX(Lists!$S:$S,MATCH(EDATE(J18,3)-1,Lists!$R:$R,0))","v":"2024/25 Q1"},{"$f":"INDEX(Lists!$S:$S,MATCH(EDATE(K18,3)-1,Lists!$R:$R,0))","v":"2024/25 Q2"},{"$f":"INDEX(Lists!$S:$S,MATCH(EDATE(L18,3)-1,Lists!$R:$R,0))","v":"2024/25 Q3"},{"$f":"INDEX(Lists!$S:$S,MATCH(EDATE(M18,3)-1,Lists!$R:$R,0))","v":"2024/25 Q4"},{"$f":"INDEX(Lists!$S:$S,MATCH(EDATE(N18,3)-1,Lists!$R:$R,0))","v":"2025/26 Q1"},{"$f":"INDEX(Lists!$S:$S,MATCH(EDATE(O18,3)-1,Lists!$R:$R,0))","v":"2025/26 Q2"},{"$f":"INDEX(Lists!$S:$S,MATCH(EDATE(P18,3)-1,Lists!$R:$R,0))","v":"2025/26 Q3"},{"$f":"INDEX(Lists!$S:$S,MATCH(EDATE(Q18,3)-1,Lists!$R:$R,0))","v":"2025/26 Q4"}]
["AO",{"$f":"COUNTIFS(Data!$U$3:$U$99780,\">=\"&B18,Data!$U$3:$U$99780,\"<\"&C18,Data!$AE$3:$AE$99780,TRUE)","v":0},{"$f":"COUNTIFS(Data!$U$3:$U$99780,\">=\"&C18,Data!$U$3:$U$99780,\"<\"&D18,Data!$AE$3:$AE$99780,TRUE)","v":0},{"$f":"COUNTIFS(Data!$U$3:$U$99780,\">=\"&D18,Data!$U$3:$U$99780,\"<\"&E18,Data!$AE$3:$AE$99780,TRUE)","v":0},{"$f":"COUNTIFS(Data!$U$3:$U$99780,\">=\"&E18,Data!$U$3:$U$99780,\"<\"&F18,Data!$AE$3:$AE$99780,TRUE)","v":0},{"$f":"COUNTIFS(Data!$U$3:$U$99780,\">=\"&F18,Data!$U$3:$U$99780,\"<\"&G18,Data!$AE$3:$AE$99780,TRUE)","v":0},{"$f":"COUNTIFS(Data!$U$3:$U$99780,\">=\"&G18,Data!$U$3:$U$99780,\"<\"&H18,Data!$AE$3:$AE$99780,TRUE)","v":0},{"$f":"COUNTIFS(Data!$U$3:$U$99780,\">=\"&H18,Data!$U$3:$U$99780,\"<\"&I18,Data!$AE$3:$AE$99780,TRUE)","v":0},{"$f":"COUNTIFS(Data!$U$3:$U$99780,\">=\"&I18,Data!$U$3:$U$99780,\"<\"&J18,Data!$AE$3:$AE$99780,TRUE)","v":0},{"$f":"COUNTIFS(Data!$U$3:$U$99780,\">=\"&J18,Data!$U$3:$U$99780,\"<\"&K18,Data!$AE$3:$AE$99780,TRUE)","v":0},{"$f":"COUNTIFS(Data!$U$3:$U$99780,\">=\"&K18,Data!$U$3:$U$99780,\"<\"&L18,Data!$AE$3:$AE$99780,TRUE)","v":0},{"$f":"COUNTIFS(Data!$U$3:$U$99780,\">=\"&L18,Data!$U$3:$U$99780,\"<\"&M18,Data!$AE$3:$AE$99780,TRUE)","v":0},{"$f":"COUNTIFS(Data!$U$3:$U$99780,\">=\"&M18,Data!$U$3:$U$99780,\"<\"&N18,Data!$AE$3:$AE$99780,TRUE)","v":0},{"$f":"COUNTIFS(Data!$U$3:$U$99780,\">=\"&N18,Data!$U$3:$U$99780,\"<\"&O18,Data!$AE$3:$AE$99780,TRUE)","v":0},{"$f":"COUNTIFS(Data!$U$3:$U$99780,\">=\"&O18,Data!$U$3:$U$99780,\"<\"&P18,Data!$AE$3:$AE$99780,TRUE)","v":0},{"$f":"COUNTIFS(Data!$U$3:$U$99780,\">=\"&P18,Data!$U$3:$U$99780,\"<\"&Q18,Data!$AE$3:$AE$99780,TRUE)","v":0},{"$f":"COUNTIFS(Data!$U$3:$U$99780,\">=\"&Q18,Data!$U$3:$U$99780,\"<\"&R18,Data!$AE$3:$AE$99780,TRUE)","v":0}]
["Placement",{"$f":"COUNTIFS(Data!$S$3:$S$99780,\">=\"&B18,Data!$S$3:$S$99780,\"<\"&C18,Data!$AE$3:$AE$99780,TRUE)","v":0},{"$f":"COUNTIFS(Data!$S$3:$S$99780,\">=\"&C18,Data!$S$3:$S$99780,\"<\"&D18,Data!$AE$3:$AE$99780,TRUE)","v":0},{"$f":"COUNTIFS(Data!$S$3:$S$99780,\">=\"&D18,Data!$S$3:$S$99780,\"<\"&E18,Data!$AE$3:$AE$99780,TRUE)","v":0},{"$f":"COUNTIFS(Data!$S$3:$S$99780,\">=\"&E18,Data!$S$3:$S$99780,\"<\"&F18,Data!$AE$3:$AE$99780,TRUE)","v":0},{"$f":"COUNTIFS(Data!$S$3:$S$99780,\">=\"&F18,Data!$S$3:$S$99780,\"<\"&G18,Data!$AE$3:$AE$99780,TRUE)","v":0},{"$f":"COUNTIFS(Data!$S$3:$S$99780,\">=\"&G18,Data!$S$3:$S$99780,\"<\"&H18,Data!$AE$3:$AE$99780,TRUE)","v":0},{"$f":"COUNTIFS(Data!$S$3:$S$99780,\">=\"&H18,Data!$S$3:$S$99780,\"<\"&I18,Data!$AE$3:$AE$99780,TRUE)","v":0},{"$f":"COUNTIFS(Data!$S$3:$S$99780,\">=\"&I18,Data!$S$3:$S$99780,\"<\"&J18,Data!$AE$3:$AE$99780,TRUE)","v":0},{"$f":"COUNTIFS(Data!$S$3:$S$99780,\">=\"&J18,Data!$S$3:$S$99780,\"<\"&K18,Data!$AE$3:$AE$99780,TRUE)","v":0},{"$f":"COUNTIFS(Data!$S$3:$S$99780,\">=\"&K18,Data!$S$3:$S$99780,\"<\"&L18,Data!$AE$3:$AE$99780,TRUE)","v":0},{"$f":"COUNTIFS(Data!$S$3:$S$99780,\">=\"&L18,Data!$S$3:$S$99780,\"<\"&M18,Data!$AE$3:$AE$99780,TRUE)","v":0},{"$f":"COUNTIFS(Data!$S$3:$S$99780,\">=\"&M18,Data!$S$3:$S$99780,\"<\"&N18,Data!$AE$3:$AE$99780,TRUE)","v":0},{"$f":"COUNTIFS(Data!$S$3:$S$99780,\">=\"&N18,Data!$S$3:$S$99780,\"<\"&O18,Data!$AE$3:$AE$99780,TRUE)","v":0},{"$f":"COUNTIFS(Data!$S$3:$S$99780,\">=\"&O18,Data!$S$3:$S$99780,\"<\"&P18,Data!$AE$3:$AE$99780,TRUE)","v":0},{"$f":"COUNTIFS(Data!$S$3:$S$99780,\">=\"&P18,Data!$S$3:$S$99780,\"<\"&Q18,Data!$AE$3:$AE$99780,TRUE)","v":0},{"$f":"COUNTIFS(Data!$S$3:$S$99780,\">=\"&Q18,Data!$S$3:$S$99780,\"<\"&R18,Data!$AE$3:$AE$99780,TRUE)","v":0}]
["Matches",{"$f":"COUNTIFS(Data!$R$3:$R$99780,\">=\"&B18,Data!$R$3:$R$99780,\"<\"&C18,Data!$AE$3:$AE$99780,TRUE)","v":0},{"$f":"COUNTIFS(Data!$R$3:$R$99780,\">=\"&C18,Data!$R$3:$R$99780,\"<\"&D18,Data!$AE$3:$AE$99780,TRUE)","v":0},{"$f":"COUNTIFS(Data!$R$3:$R$99780,\">=\"&D18,Data!$R$3:$R$99780,\"<\"&E18,Data!$AE$3:$AE$99780,TRUE)","v":0},{"$f":"COUNTIFS(Data!$R$3:$R$99780,\">=\"&E18,Data!$R$3:$R$99780,\"<\"&F18,Data!$AE$3:$AE$99780,TRUE)","v":0},{"$f":"COUNTIFS(Data!$R$3:$R$99780,\">=\"&F18,Data!$R$3:$R$99780,\"<\"&G18,Data!$AE$3:$AE$99780,TRUE)","v":0},{"$f":"COUNTIFS(Data!$R$3:$R$99780,\">=\"&G18,Data!$R$3:$R$99780,\"<\"&H18,Data!$AE$3:$AE$99780,TRUE)","v":0},{"$f":"COUNTIFS(Data!$R$3:$R$99780,\">=\"&H18,Data!$R$3:$R$99780,\"<\"&I18,Data!$AE$3:$AE$99780,TRUE)","v":0},{"$f":"COUNTIFS(Data!$R$3:$R$99780,\">=\"&I18,Data!$R$3:$R$99780,\"<\"&J18,Data!$AE$3:$AE$99780,TRUE)","v":0},{"$f":"COUNTIFS(Data!$R$3:$R$99780,\">=\"&J18,Data!$R$3:$R$99780,\"<\"&K18,Data!$AE$3:$AE$99780,TRUE)","v":0},{"$f":"COUNTIFS(Data!$R$3:$R$99780,\">=\"&K18,Data!$R$3:$R$99780,\"<\"&L18,Data!$AE$3:$AE$99780,TRUE)","v":0},{"$f":"COUNTIFS(Data!$R$3:$R$99780,\">=\"&L18,Data!$R$3:$R$99780,\"<\"&M18,Data!$AE$3:$AE$99780,TRUE)","v":0},{"$f":"COUNTIFS(Data!$R$3:$R$99780,\">=\"&M18,Data!$R$3:$R$99780,\"<\"&N18,Data!$AE$3:$AE$99780,TRUE)","v":0},{"$f":"COUNTIFS(Data!$R$3:$R$99780,\">=\"&N18,Data!$R$3:$R$99780,\"<\"&O18,Data!$AE$3:$AE$99780,TRUE)","v":0},{"$f":"COUNTIFS(Data!$R$3:$R$99780,\">=\"&O18,Data!$R$3:$R$99780,\"<\"&P18,Data!$AE$3:$AE$99780,TRUE)","v":0},{"$f":"COUNTIFS(Data!$R$3:$R$99780,\">=\"&P18,Data!$R$3:$R$99780,\"<\"&Q18,Data!$AE$3:$AE$99780,TRUE)","v":0},{"$f":"COUNTIFS(Data!$R$3:$R$99780,\">=\"&Q18,Data!$R$3:$R$99780,\"<\"&R18,Data!$AE$3:$AE$99780,TRUE)","v":0}]
["Approvals",{"$f":"COUNTIFS(Data!$Q$3:$Q$99780,\">=\"&B18,Data!$Q$3:$Q$99780,\"<\"&C18,Data!$AE$3:$AE$99780,TRUE)","v":0},{"$f":"COUNTIFS(Data!$Q$3:$Q$99780,\">=\"&C18,Data!$Q$3:$Q$99780,\"<\"&D18,Data!$AE$3:$AE$99780,TRUE)","v":0},{"$f":"COUNTIFS(Data!$Q$3:$Q$99780,\">=\"&D18,Data!$Q$3:$Q$99780,\"<\"&E18,Data!$AE$3:$AE$99780,TRUE)","v":0},{"$f":"COUNTIFS(Data!$Q$3:$Q$99780,\">=\"&E18,Data!$Q$3:$Q$99780,\"<\"&F18,Data!$AE$3:$AE$99780,TRUE)","v":0},{"$f":"COUNTIFS(Data!$Q$3:$Q$99780,\">=\"&F18,Data!$Q$3:$Q$99780,\"<\"&G18,Data!$AE$3:$AE$99780,TRUE)","v":0},{"$f":"COUNTIFS(Data!$Q$3:$Q$99780,\">=\"&G18,Data!$Q$3:$Q$99780,\"<\"&H18,Data!$AE$3:$AE$99780,TRUE)","v":0},{"$f":"COUNTIFS(Data!$Q$3:$Q$99780,\">=\"&H18,Data!$Q$3:$Q$99780,\"<\"&I18,Data!$AE$3:$AE$99780,TRUE)","v":0},{"$f":"COUNTIFS(Data!$Q$3:$Q$99780,\">=\"&I18,Data!$Q$3:$Q$99780,\"<\"&J18,Data!$AE$3:$AE$99780,TRUE)","v":0},{"$f":"COUNTIFS(Data!$Q$3:$Q$99780,\">=\"&J18,Data!$Q$3:$Q$99780,\"<\"&K18,Data!$AE$3:$AE$99780,TRUE)","v":0},{"$f":"COUNTIFS(Data!$Q$3:$Q$99780,\">=\"&K18,Data!$Q$3:$Q$99780,\"<\"&L18,Data!$AE$3:$AE$99780,TRUE)","v":0},{"$f":"COUNTIFS(Data!$Q$3:$Q$99780,\">=\"&L18,Data!$Q$3:$Q$99780,\"<\"&M18,Data!$AE$3:$AE$99780,TRUE)","v":0},{"$f":"COUNTIFS(Data!$Q$3:$Q$99780,\">=\"&M18,Data!$Q$3:$Q$99780,\"<\"&N18,Data!$AE$3:$AE$99780,TRUE)","v":0},{"$f":"COUNTIFS(Data!$Q$3:$Q$99780,\">=\"&N18,Data!$Q$3:$Q$99780,\"<\"&O18,Data!$AE$3:$AE$99780,TRUE)","v":0},{"$f":"COUNTIFS(Data!$Q$3:$Q$99780,\">=\"&O18,Data!$Q$3:$Q$99780,\"<\"&P18,Data!$AE$3:$AE$99780,TRUE)","v":0},{"$f":"COUNTIFS(Data!$Q$3:$Q$99780,\">=\"&P18,Data!$Q$3:$Q$99780,\"<\"&Q18,Data!$AE$3:$AE$99780,TRUE)","v":0},{"$f":"COUNTIFS(Data!$Q$3:$Q$99780,\">=\"&Q18,Data!$Q$3:$Q$99780,\"<\"&R18,Data!$AE$3:$AE$99780,TRUE)","v":0}]
["S2 start",{"$f":"COUNTIFS(Data!$P$3:$P$99780,\">=\"&B18,Data!$P$3:$P$99780,\"<\"&C18,Data!$AE$3:$AE$99780,TRUE)","v":0},{"$f":"COUNTIFS(Data!$P$3:$P$99780,\">=\"&C18,Data!$P$3:$P$99780,\"<\"&D18,Data!$AE$3:$AE$99780,TRUE)","v":0},{"$f":"COUNTIFS(Data!$P$3:$P$99780,\">=\"&D18,Data!$P$3:$P$99780,\"<\"&E18,Data!$AE$3:$AE$99780,TRUE)","v":0},{"$f":"COUNTIFS(Data!$P$3:$P$99780,\">=\"&E18,Data!$P$3:$P$99780,\"<\"&F18,Data!$AE$3:$AE$99780,TRUE)","v":0},{"$f":"COUNTIFS(Data!$P$3:$P$99780,\">=\"&F18,Data!$P$3:$P$99780,\"<\"&G18,Data!$AE$3:$AE$99780,TRUE)","v":0},{"$f":"COUNTIFS(Data!$P$3:$P$99780,\">=\"&G18,Data!$P$3:$P$99780,\"<\"&H18,Data!$AE$3:$AE$99780,TRUE)","v":0},{"$f":"COUNTIFS(Data!$P$3:$P$99780,\">=\"&H18,Data!$P$3:$P$99780,\"<\"&I18,Data!$AE$3:$AE$99780,TRUE)","v":0},{"$f":"COUNTIFS(Data!$P$3:$P$99780,\">=\"&I18,Data!$P$3:$P$99780,\"<\"&J18,Data!$AE$3:$AE$99780,TRUE)","v":0},{"$f":"COUNTIFS(Data!$P$3:$P$99780,\">=\"&J18,Data!$P$3:$P$99780,\"<\"&K18,Data!$AE$3:$AE$99780,TRUE)","v":0},{"$f":"COUNTIFS(Data!$P$3:$P$99780,\">=\"&K18,Data!$P$3:$P$99780,\"<\"&L18,Data!$AE$3:$AE$99780,TRUE)","v":0},{"$f":"COUNTIFS(Data!$P$3:$P$99780,\">=\"&L18,Data!$P$3:$P$99780,\"<\"&M18,Data!$AE$3:$AE$99780,TRUE)","v":0},{"$f":"COUNTIFS(Data!$P$3:$P$99780,\">=\"&M18,Data!$P$3:$P$99780,\"<\"&N18,Data!$AE$3:$AE$99780,TRUE)","v":0},{"$f":"COUNTIFS(Data!$P$3:$P$99780,\">=\"&N18,Data!$P$3:$P$99780,\"<\"&O18,Data!$AE$3:$AE$99780,TRUE)","v":0},{"$f":"COUNTIFS(Data!$P$3:$P$99780,\">=\"&O18,Data!$P$3:$P$99780,\"<\"&P18,Data!$AE$3:$AE$99780,TRUE)","v":0},{"$f":"COUNTIFS(Data!$P$3:$P$99780,\">=\"&P18,Data!$P$3:$P$99780,\"<\"&Q18,Data!$AE$3:$AE$99780,TRUE)","v":0},{"$f":"COUNTIFS(Data!$P$3:$P$99780,\">=\"&Q18,Data!$P$3:$P$99780,\"<\"&R18,Data!$AE$3:$AE$99780,TRUE)","v":0}]
["S1 end",{"$f":"COUNTIFS(Data!$O$3:$O$99780,\">=\"&B18,Data!$O$3:$O$99780,\"<\"&C18,Data!$AE$3:$AE$99780,TRUE)","v":0},{"$f":"COUNTIFS(Data!$O$3:$O$99780,\">=\"&C18,Data!$O$3:$O$99780,\"<\"&D18,Data!$AE$3:$AE$99780,TRUE)","v":0},{"$f":"COUNTIFS(Data!$O$3:$O$99780,\">=\"&D18,Data!$O$3:$O$99780,\"<\"&E18,Data!$AE$3:$AE$99780,TRUE)","v":0},{"$f":"COUNTIFS(Data!$O$3:$O$99780,\">=\"&E18,Data!$O$3:$O$99780,\"<\"&F18,Data!$AE$3:$AE$99780,TRUE)","v":0},{"$f":"COUNTIFS(Data!$O$3:$O$99780,\">=\"&F18,Data!$O$3:$O$99780,\"<\"&G18,Data!$AE$3:$AE$99780,TRUE)","v":0},{"$f":"COUNTIFS(Data!$O$3:$O$99780,\">=\"&G18,Data!$O$3:$O$99780,\"<\"&H18,Data!$AE$3:$AE$99780,TRUE)","v":0},{"$f":"COUNTIFS(Data!$O$3:$O$99780,\">=\"&H18,Data!$O$3:$O$99780,\"<\"&I18,Data!$AE$3:$AE$99780,TRUE)","v":0},{"$f":"COUNTIFS(Data!$O$3:$O$99780,\">=\"&I18,Data!$O$3:$O$99780,\"<\"&J18,Data!$AE$3:$AE$99780,TRUE)","v":0},{"$f":"COUNTIFS(Data!$O$3:$O$99780,\">=\"&J18,Data!$O$3:$O$99780,\"<\"&K18,Data!$AE$3:$AE$99780,TRUE)","v":0},{"$f":"COUNTIFS(Data!$O$3:$O$99780,\">=\"&K18,Data!$O$3:$O$99780,\"<\"&L18,Data!$AE$3:$AE$99780,TRUE)","v":0},{"$f":"COUNTIFS(Data!$O$3:$O$99780,\">=\"&L18,Data!$O$3:$O$99780,\"<\"&M18,Data!$AE$3:$AE$99780,TRUE)","v":0},{"$f":"COUNTIFS(Data!$O$3:$O$99780,\">=\"&M18,Data!$O$3:$O$99780,\"<\"&N18,Data!$AE$3:$AE$99780,TRUE)","v":0},{"$f":"COUNTIFS(Data!$O$3:$O$99780,\">=\"&N18,Data!$O$3:$O$99780,\"<\"&O18,Data!$AE$3:$AE$99780,TRUE)","v":0},{"$f":"COUNTIFS(Data!$O$3:$O$99780,\">=\"&O18,Data!$O$3:$O$99780,\"<\"&P18,Data!$AE$3:$AE$99780,TRUE)","v":0},{"$f":"COUNTIFS(Data!$O$3:$O$99780,\">=\"&P18,Data!$O$3:$O$99780,\"<\"&Q18,Data!$AE$3:$AE$99780,TRUE)","v":0},{"$f":"COUNTIFS(Data!$O$3:$O$99780,\">=\"&Q18,Data!$O$3:$O$99780,\"<\"&R18,Data!$AE$3:$AE$99780,TRUE)","v":0}]
["S1 start",{"$f":"COUNTIFS(Data!$N$3:$N$99780,\">=\"&B18,Data!$N$3:$N$99780,\"<\"&C18,Data!$AE$3:$AE$99780,TRUE)","v":0},{"$f":"COUNTIFS(Data!$N$3:$N$99780,\">=\"&C18,Data!$N$3:$N$99780,\"<\"&D18,Data!$AE$3:$AE$99780,TRUE)","v":0},{"$f":"COUNTIFS(Data!$N$3:$N$99780,\">=\"&D18,Data!$N$3:$N$99780,\"<\"&E18,Data!$AE$3:$AE$99780,TRUE)","v":0},{"$f":"COUNTIFS(Data!$N$3:$N$99780,\">=\"&E18,Data!$N$3:$N$99780,\"<\"&F18,Data!$AE$3:$AE$99780,TRUE)","v":0},{"$f":"COUNTIFS(Data!$N$3:$N$99780,\">=\"&F18,Data!$N$3:$N$99780,\"<\"&G18,Data!$AE$3:$AE$99780,TRUE)","v":0},{"$f":"COUNTIFS(Data!$N$3:$N$99780,\">=\"&G18,Data!$N$3:$N$99780,\"<\"&H18,Data!$AE$3:$AE$99780,TRUE)","v":0},{"$f":"COUNTIFS(Data!$N$3:$N$99780,\">=\"&H18,Data!$N$3:$N$99780,\"<\"&I18,Data!$AE$3:$AE$99780,TRUE)","v":0},{"$f":"COUNTIFS(Data!$N$3:$N$99780,\">=\"&I18,Data!$N$3:$N$99780,\"<\"&J18,Data!$AE$3:$AE$99780,TRUE)","v":0},{"$f":"COUNTIFS(Data!$N$3:$N$99780,\">=\"&J18,Data!$N$3:$N$99780,\"<\"&K18,Data!$AE$3:$AE$99780,TRUE)","v":0},{"$f":"COUNTIFS(Data!$N$3:$N$99780,\">=\"&K18,Data!$N$3:$N$99780,\"<\"&L18,Data!$AE$3:$AE$99780,TRUE)","v":0},{"$f":"COUNTIFS(Data!$N$3:$N$99780,\">=\"&L18,Data!$N$3:$N$99780,\"<\"&M18,Data!$AE$3:$AE$99780,TRUE)","v":0},{"$f":"COUNTIFS(Data!$N$3:$N$99780,\">=\"&M18,Data!$N$3:$N$99780,\"<\"&N18,Data!$AE$3:$AE$99780,TRUE)","v":0},{"$f":"COUNTIFS(Data!$N$3:$N$99780,\">=\"&N18,Data!$N$3:$N$99780,\"<\"&O18,Data!$AE$3:$AE$99780,TRUE)","v":0},{"$f":"COUNTIFS(Data!$N$3:$N$99780,\">=\"&O18,Data!$N$3:$N$99780,\"<\"&P18,Data!$AE$3:$AE$99780,TRUE)","v":0},{"$f":"COUNTIFS(Data!$N$3:$N$99780,\">=\"&P18,Data!$N$3:$N$99780,\"<\"&Q18,Data!$AE$3:$AE$99780,TRUE)","v":0},{"$f":"COUNTIFS(Data!$N$3:$N$99780,\">=\"&Q18,Data!$N$3:$N$99780,\"<\"&R18,Data!$AE$3:$AE$99780,TRUE)","v":0}]
["Post-approval withdrawal",{"$f":"COUNTIFS(Data!$Q$3:$Q$99780,\"<>\",Data!$W$3:$W$99780,\"<\"&C18,Data!$W$3:$W$99780,\">=\"&B18,Data!$X$3:$X$99780,1,Data!$AE$3:$AE$99780,TRUE)","v":0},{"$f":"COUNTIFS(Data!$Q$3:$Q$99780,\"<>\",Data!$W$3:$W$99780,\"<\"&D18,Data!$W$3:$W$99780,\">=\"&C18,Data!$X$3:$X$99780,1,Data!$AE$3:$AE$99780,TRUE)","v":0},{"$f":"COUNTIFS(Data!$Q$3:$Q$99780,\"<>\",Data!$W$3:$W$99780,\"<\"&E18,Data!$W$3:$W$99780,\">=\"&D18,Data!$X$3:$X$99780,1,Data!$AE$3:$AE$99780,TRUE)","v":0},{"$f":"COUNTIFS(Data!$Q$3:$Q$99780,\"<>\",Data!$W$3:$W$99780,\"<\"&F18,Data!$W$3:$W$99780,\">=\"&E18,Data!$X$3:$X$99780,1,Data!$AE$3:$AE$99780,TRUE)","v":0},{"$f":"COUNTIFS(Data!$Q$3:$Q$99780,\"<>\",Data!$W$3:$W$99780,\"<\"&G18,Data!$W$3:$W$99780,\">=\"&F18,Data!$X$3:$X$99780,1,Data!$AE$3:$AE$99780,TRUE)","v":0},{"$f":"COUNTIFS(Data!$Q$3:$Q$99780,\"<>\",Data!$W$3:$W$99780,\"<\"&H18,Data!$W$3:$W$99780,\">=\"&G18,Data!$X$3:$X$99780,1,Data!$AE$3:$AE$99780,TRUE)","v":0},{"$f":"COUNTIFS(Data!$Q$3:$Q$99780,\"<>\",Data!$W$3:$W$99780,\"<\"&I18,Data!$W$3:$W$99780,\">=\"&H18,Data!$X$3:$X$99780,1,Data!$AE$3:$AE$99780,TRUE)","v":0},{"$f":"COUNTIFS(Data!$Q$3:$Q$99780,\"<>\",Data!$W$3:$W$99780,\"<\"&J18,Data!$W$3:$W$99780,\">=\"&I18,Data!$X$3:$X$99780,1,Data!$AE$3:$AE$99780,TRUE)","v":0},{"$f":"COUNTIFS(Data!$Q$3:$Q$99780,\"<>\",Data!$W$3:$W$99780,\"<\"&K18,Data!$W$3:$W$99780,\">=\"&J18,Data!$X$3:$X$99780,1,Data!$AE$3:$AE$99780,TRUE)","v":0},{"$f":"COUNTIFS(Data!$Q$3:$Q$99780,\"<>\",Data!$W$3:$W$99780,\"<\"&L18,Data!$W$3:$W$99780,\">=\"&K18,Data!$X$3:$X$99780,1,Data!$AE$3:$AE$99780,TRUE)","v":0},{"$f":"COUNTIFS(Data!$Q$3:$Q$99780,\"<>\",Data!$W$3:$W$99780,\"<\"&M18,Data!$W$3:$W$99780,\">=\"&L18,Data!$X$3:$X$99780,1,Data!$AE$3:$AE$99780,TRUE)","v":0},{"$f":"COUNTIFS(Data!$Q$3:$Q$99780,\"<>\",Data!$W$3:$W$99780,\"<\"&N18,Data!$W$3:$W$99780,\">=\"&M18,Data!$X$3:$X$99780,1,Data!$AE$3:$AE$99780,TRUE)","v":0},{"$f":"COUNTIFS(Data!$Q$3:$Q$99780,\"<>\",Data!$W$3:$W$99780,\"<\"&O18,Data!$W$3:$W$99780,\">=\"&N18,Data!$X$3:$X$99780,1,Data!$AE$3:$AE$99780,TRUE)","v":0},{"$f":"COUNTIFS(Data!$Q$3:$Q$99780,\"<>\",Data!$W$3:$W$99780,\"<\"&P18,Data!$W$3:$W$99780,\">=\"&O18,Data!$X$3:$X$99780,1,Data!$AE$3:$AE$99780,TRUE)","v":0},{"$f":"COUNTIFS(Data!$Q$3:$Q$99780,\"<>\",Data!$W$3:$W$99780,\"<\"&Q18,Data!$W$3:$W$99780,\">=\"&P18,Data!$X$3:$X$99780,1,Data!$AE$3:$AE$99780,TRUE)","v":0},{"$f":"COUNTIFS(Data!$Q$3:$Q$99780,\"<>\",Data!$W$3:$W$99780,\"<\"&R18,Data!$W$3:$W$99780,\">=\"&Q18,Data!$X$3:$X$99780,1,Data!$AE$3:$AE$99780,TRUE)","v":0}]
["S2 refusal/withdrawal",{"$f":"COUNTIFS(Data!$P$3:$P$99780,\"<>\",Data!$Q$3:$Q$99780,\"\",Data!$R$3:$R$99780,\"\",Data!$S$3:$S$99780,\"\",Data!$U$3:$U$99780,\"\",Data!$W$3:$W$99780,\"<\"&C18,Data!$W$3:$W$99780,\">=\"&B18,Data!$X$3:$X$99780,\"<>2\",Data!$AE$3:$AE$99780,TRUE)","v":0},{"$f":"COUNTIFS(Data!$P$3:$P$99780,\"<>\",Data!$Q$3:$Q$99780,\"\",Data!$R$3:$R$99780,\"\",Data!$S$3:$S$99780,\"\",Data!$U$3:$U$99780,\"\",Data!$W$3:$W$99780,\"<\"&D18,Data!$W$3:$W$99780,\">=\"&C18,Data!$X$3:$X$99780,\"<>2\",Data!$AE$3:$AE$99780,TRUE)","v":0},{"$f":"COUNTIFS(Data!$P$3:$P$99780,\"<>\",Data!$Q$3:$Q$99780,\"\",Data!$R$3:$R$99780,\"\",Data!$S$3:$S$99780,\"\",Data!$U$3:$U$99780,\"\",Data!$W$3:$W$99780,\"<\"&E18,Data!$W$3:$W$99780,\">=\"&D18,Data!$X$3:$X$99780,\"<>2\",Data!$AE$3:$AE$99780,TRUE)","v":0},{"$f":"COUNTIFS(Data!$P$3:$P$99780,\"<>\",Data!$Q$3:$Q$99780,\"\",Data!$R$3:$R$99780,\"\",Data!$S$3:$S$99780,\"\",Data!$U$3:$U$99780,\"\",Data!$W$3:$W$99780,\"<\"&F18,Data!$W$3:$W$99780,\">=\"&E18,Data!$X$3:$X$99780,\"<>2\",Data!$AE$3:$AE$99780,TRUE)","v":0},{"$f":"COUNTIFS(Data!$P$3:$P$99780,\"<>\",Data!$Q$3:$Q$99780,\"\",Data!$R$3:$R$99780,\"\",Data!$S$3:$S$99780,\"\",Data!$U$3:$U$99780,\"\",Data!$W$3:$W$99780,\"<\"&G18,Data!$W$3:$W$99780,\">=\"&F18,Data!$X$3:$X$99780,\"<>2\",Data!$AE$3:$AE$99780,TRUE)","v":0},{"$f":"COUNTIFS(Data!$P$3:$P$99780,\"<>\",Data!$Q$3:$Q$99780,\"\",Data!$R$3:$R$99780,\"\",Data!$S$3:$S$99780,\"\",Data!$U$3:$U$99780,\"\",Data!$W$3:$W$99780,\"<\"&H18,Data!$W$3:$W$99780,\">=\"&G18,Data!$X$3:$X$99780,\"<>2\",Data!$AE$3:$AE$99780,TRUE)","v":0},{"$f":"COUNTIFS(Data!$P$3:$P$99780,\"<>\",Data!$Q$3:$Q$99780,\"\",Data!$R$3:$R$99780,\"\",Data!$S$3:$S$99780,\"\",Data!$U$3:$U$99780,\"\",Data!$W$3:$W$99780,\"<\"&I18,Data!$W$3:$W$99780,\">=\"&H18,Data!$X$3:$X$99780,\"<>2\",Data!$AE$3:$AE$99780,TRUE)","v":0},{"$f":"COUNTIFS(Data!$P$3:$P$99780,\"<>\",Data!$Q$3:$Q$99780,\"\",Data!$R$3:$R$99780,\"\",Data!$S$3:$S$99780,\"\",Data!$U$3:$U$99780,\"\",Data!$W$3:$W$99780,\"<\"&J18,Data!$W$3:$W$99780,\">=\"&I18,Data!$X$3:$X$99780,\"<>2\",Data!$AE$3:$AE$99780,TRUE)","v":0},{"$f":"COUNTIFS(Data!$P$3:$P$99780,\"<>\",Data!$Q$3:$Q$99780,\"\",Data!$R$3:$R$99780,\"\",Data!$S$3:$S$99780,\"\",Data!$U$3:$U$99780,\"\",Data!$W$3:$W$99780,\"<\"&K18,Data!$W$3:$W$99780,\">=\"&J18,Data!$X$3:$X$99780,\"<>2\",Data!$AE$3:$AE$99780,TRUE)","v":0},{"$f":"COUNTIFS(Data!$P$3:$P$99780,\"<>\",Data!$Q$3:$Q$99780,\"\",Data!$R$3:$R$99780,\"\",Data!$S$3:$S$99780,\"\",Data!$U$3:$U$99780,\"\",Data!$W$3:$W$99780,\"<\"&L18,Data!$W$3:$W$99780,\">=\"&K18,Data!$X$3:$X$99780,\"<>2\",Data!$AE$3:$AE$99780,TRUE)","v":0},{"$f":"COUNTIFS(Data!$P$3:$P$99780,\"<>\",Data!$Q$3:$Q$99780,\"\",Data!$R$3:$R$99780,\"\",Data!$S$3:$S$99780,\"\",Data!$U$3:$U$99780,\"\",Data!$W$3:$W$99780,\"<\"&M18,Data!$W$3:$W$99780,\">=\"&L18,Data!$X$3:$X$99780,\"<>2\",Data!$AE$3:$AE$99780,TRUE)","v":0},{"$f":"COUNTIFS(Data!$P$3:$P$99780,\"<>\",Data!$Q$3:$Q$99780,\"\",Data!$R$3:$R$99780,\"\",Data!$S$3:$S$99780,\"\",Data!$U$3:$U$99780,\"\",Data!$W$3:$W$99780,\"<\"&N18,Data!$W$3:$W$99780,\">=\"&M18,Data!$X$3:$X$99780,\"<>2\",Data!$AE$3:$AE$99780,TRUE)","v":0},{"$f":"COUNTIFS(Data!$P$3:$P$99780,\"<>\",Data!$Q$3:$Q$99780,\"\",Data!$R$3:$R$99780,\"\",Data!$S$3:$S$99780,\"\",Data!$U$3:$U$99780,\"\",Data!$W$3:$W$99780,\"<\"&O18,Data!$W$3:$W$99780,\">=\"&N18,Data!$X$3:$X$99780,\"<>2\",Data!$AE$3:$AE$99780,TRUE)","v":0},{"$f":"COUNTIFS(Data!$P$3:$P$99780,\"<>\",Data!$Q$3:$Q$99780,\"\",Data!$R$3:$R$99780,\"\",Data!$S$3:$S$99780,\"\",Data!$U$3:$U$99780,\"\",Data!$W$3:$W$99780,\"<\"&P18,Data!$W$3:$W$99780,\">=\"&O18,Data!$X$3:$X$99780,\"<>2\",Data!$AE$3:$AE$99780,TRUE)","v":0},{"$f":"COUNTIFS(Data!$P$3:$P$99780,\"<>\",Data!$Q$3:$Q$99780,\"\",Data!$R$3:$R$99780,\"\",Data!$S$3:$S$99780,\"\",Data!$U$3:$U$99780,\"\",Data!$W$3:$W$99780,\"<\"&Q18,Data!$W$3:$W$99780,\">=\"&P18,Data!$X$3:$X$99780,\"<>2\",Data!$AE$3:$AE$99780,TRUE)","v":0},{"$f":"COUNTIFS(Data!$P$3:$P$99780,\"<>\",Data!$Q$3:$Q$99780,\"\",Data!$R$3:$R$99780,\"\",Data!$S$3:$S$99780,\"\",Data!$U$3:$U$99780,\"\",Data!$W$3:$W$99780,\"<\"&R18,Data!$W$3:$W$99780,\">=\"&Q18,Data!$X$3:$X$99780,\"<>2\",Data!$AE$3:$AE$99780,TRUE)","v":0}]
["S1 refusal/withdrawal",{"$f":"COUNTIFS(Data!$N$3:$N$99780,\"<>\",Data!$O$3:$O$99780,\"\",Data!$P$3:$P$99780,\"\",Data!$Q$3:$Q$99780,\"\",Data!$R$3:$R$99780,\"\",Data!$S$3:$S$99780,\"\",Data!$U$3:$U$99780,\"\",Data!$W$3:$W$99780,\"<\"&C18,Data!$W$3:$W$99780,\">=\"&B18,Data!$X$3:$X$99780,\"<>2\",Data!$AE$3:$AE$99780,TRUE)","v":0},{"$f":"COUNTIFS(Data!$N$3:$N$99780,\"<>\",Data!$O$3:$O$99780,\"\",Data!$P$3:$P$99780,\"\",Data!$Q$3:$Q$99780,\"\",Data!$R$3:$R$99780,\"\",Data!$S$3:$S$99780,\"\",Data!$U$3:$U$99780,\"\",Data!$W$3:$W$99780,\"<\"&D18,Data!$W$3:$W$99780,\">=\"&C18,Data!$X$3:$X$99780,\"<>2\",Data!$AE$3:$AE$99780,TRUE)","v":0},{"$f":"COUNTIFS(Data!$N$3:$N$99780,\"<>\",Data!$O$3:$O$99780,\"\",Data!$P$3:$P$99780,\"\",Data!$Q$3:$Q$99780,\"\",Data!$R$3:$R$99780,\"\",Data!$S$3:$S$99780,\"\",Data!$U$3:$U$99780,\"\",Data!$W$3:$W$99780,\"<\"&E18,Data!$W$3:$W$99780,\">=\"&D18,Data!$X$3:$X$99780,\"<>2\",Data!$AE$3:$AE$99780,TRUE)","v":0},{"$f":"COUNTIFS(Data!$N$3:$N$99780,\"<>\",Data!$O$3:$O$99780,\"\",Data!$P$3:$P$99780,\"\",Data!$Q$3:$Q$99780,\"\",Data!$R$3:$R$99780,\"\",Data!$S$3:$S$99780,\"\",Data!$U$3:$U$99780,\"\",Data!$W$3:$W$99780,\"<\"&F18,Data!$W$3:$W$99780,\">=\"&E18,Data!$X$3:$X$99780,\"<>2\",Data!$AE$3:$AE$99780,TRUE)","v":0},{"$f":"COUNTIFS(Data!$N$3:$N$99780,\"<>\",Data!$O$3:$O$99780,\"\",Data!$P$3:$P$99780,\"\",Data!$Q$3:$Q$99780,\"\",Data!$R$3:$R$99780,\"\",Data!$S$3:$S$99780,\"\",Data!$U$3:$U$99780,\"\",Data!$W$3:$W$99780,\"<\"&G18,Data!$W$3:$W$99780,\">=\"&F18,Data!$X$3:$X$99780,\"<>2\",Data!$AE$3:$AE$99780,TRUE)","v":0},{"$f":"COUNTIFS(Data!$N$3:$N$99780,\"<>\",Data!$O$3:$O$99780,\"\",Data!$P$3:$P$99780,\"\",Data!$Q$3:$Q$99780,\"\",Data!$R$3:$R$99780,\"\",Data!$S$3:$S$99780,\"\",Data!$U$3:$U$99780,\"\",Data!$W$3:$W$99780,\"<\"&H18,Data!$W$3:$W$99780,\">=\"&G18,Data!$X$3:$X$99780,\"<>2\",Data!$AE$3:$AE$99780,TRUE)","v":0},{"$f":"COUNTIFS(Data!$N$3:$N$99780,\"<>\",Data!$O$3:$O$99780,\"\",Data!$P$3:$P$99780,\"\",Data!$Q$3:$Q$99780,\"\",Data!$R$3:$R$99780,\"\",Data!$S$3:$S$99780,\"\",Data!$U$3:$U$99780,\"\",Data!$W$3:$W$99780,\"<\"&I18,Data!$W$3:$W$99780,\">=\"&H18,Data!$X$3:$X$99780,\"<>2\",Data!$AE$3:$AE$99780,TRUE)","v":0},{"$f":"COUNTIFS(Data!$N$3:$N$99780,\"<>\",Data!$O$3:$O$99780,\"\",Data!$P$3:$P$99780,\"\",Data!$Q$3:$Q$99780,\"\",Data!$R$3:$R$99780,\"\",Data!$S$3:$S$99780,\"\",Data!$U$3:$U$99780,\"\",Data!$W$3:$W$99780,\"<\"&J18,Data!$W$3:$W$99780,\">=\"&I18,Data!$X$3:$X$99780,\"<>2\",Data!$AE$3:$AE$99780,TRUE)","v":0},{"$f":"COUNTIFS(Data!$N$3:$N$99780,\"<>\",Data!$O$3:$O$99780,\"\",Data!$P$3:$P$99780,\"\",Data!$Q$3:$Q$99780,\"\",Data!$R$3:$R$99780,\"\",Data!$S$3:$S$99780,\"\",Data!$U$3:$U$99780,\"\",Data!$W$3:$W$99780,\"<\"&K18,Data!$W$3:$W$99780,\">=\"&J18,Data!$X$3:$X$99780,\"<>2\",Data!$AE$3:$AE$99780,TRUE)","v":0},{"$f":"COUNTIFS(Data!$N$3:$N$99780,\"<>\",Data!$O$3:$O$99780,\"\",Data!$P$3:$P$99780,\"\",Data!$Q$3:$Q$99780,\"\",Data!$R$3:$R$99780,\"\",Data!$S$3:$S$99780,\"\",Data!$U$3:$U$99780,\"\",Data!$W$3:$W$99780,\"<\"&L18,Data!$W$3:$W$99780,\">=\"&K18,Data!$X$3:$X$99780,\"<>2\",Data!$AE$3:$AE$99780,TRUE)","v":0},{"$f":"COUNTIFS(Data!$N$3:$N$99780,\"<>\",Data!$O$3:$O$99780,\"\",Data!$P$3:$P$99780,\"\",Data!$Q$3:$Q$99780,\"\",Data!$R$3:$R$99780,\"\",Data!$S$3:$S$99780,\"\",Data!$U$3:$U$99780,\"\",Data!$W$3:$W$99780,\"<\"&M18,Data!$W$3:$W$99780,\">=\"&L18,Data!$X$3:$X$99780,\"<>2\",Data!$AE$3:$AE$99780,TRUE)","v":0},{"$f":"COUNTIFS(Data!$N$3:$N$99780,\"<>\",Data!$O$3:$O$99780,\"\",Data!$P$3:$P$99780,\"\",Data!$Q$3:$Q$99780,\"\",Data!$R$3:$R$99780,\"\",Data!$S$3:$S$99780,\"\",Data!$U$3:$U$99780,\"\",Data!$W$3:$W$99780,\"<\"&N18,Data!$W$3:$W$99780,\">=\"&M18,Data!$X$3:$X$99780,\"<>2\",Data!$AE$3:$AE$99780,TRUE)","v":0},{"$f":"COUNTIFS(Data!$N$3:$N$99780,\"<>\",Data!$O$3:$O$99780,\"\",Data!$P$3:$P$99780,\"\",Data!$Q$3:$Q$99780,\"\",Data!$R$3:$R$99780,\"\",Data!$S$3:$S$99780,\"\",Data!$U$3:$U$99780,\"\",Data!$W$3:$W$99780,\"<\"&O18,Data!$W$3:$W$99780,\">=\"&N18,Data!$X$3:$X$99780,\"<>2\",Data!$AE$3:$AE$99780,TRUE)","v":0},{"$f":"COUNTIFS(Data!$N$3:$N$99780,\"<>\",Data!$O$3:$O$99780,\"\",Data!$P$3:$P$99780,\"\",Data!$Q$3:$Q$99780,\"\",Data!$R$3:$R$99780,\"\",Data!$S$3:$S$99780,\"\",Data!$U$3:$U$99780,\"\",Data!$W$3:$W$99780,\"<\"&P18,Data!$W$3:$W$99780,\">=\"&O18,Data!$X$3:$X$99780,\"<>2\",Data!$AE$3:$AE$99780,TRUE)","v":0},{"$f":"COUNTIFS(Data!$N$3:$N$99780,\"<>\",Data!$O$3:$O$99780,\"\",Data!$P$3:$P$99780,\"\",Data!$Q$3:$Q$99780,\"\",Data!$R$3:$R$99780,\"\",Data!$S$3:$S$99780,\"\",Data!$U$3:$U$99780,\"\",Data!$W$3:$W$99780,\"<\"&Q18,Data!$W$3:$W$99780,\">=\"&P18,Data!$X$3:$X$99780,\"<>2\",Data!$AE$3:$AE$99780,TRUE)","v":0},{"$f":"COUNTIFS(Data!$N$3:$N$99780,\"<>\",Data!$O$3:$O$99780,\"\",Data!$P$3:$P$99780,\"\",Data!$Q$3:$Q$99780,\"\",Data!$R$3:$R$99780,\"\",Data!$S$3:$S$99780,\"\",Data!$U$3:$U$99780,\"\",Data!$W$3:$W$99780,\"<\"&R18,Data!$W$3:$W$99780,\">=\"&Q18,Data!$X$3:$X$99780,\"<>2\",Data!$AE$3:$AE$99780,TRUE)","v":0}]
["Approved and waiting"]
[null,{"$f":"B6","v":"2022-04-01"},{"$f":"EDATE(B31,12)","v":"2023-04-01"},{"$f":"EDATE(C31,12)","v":"2024-04-01"},"2025-04-01","2026-04-01"]
["ANNUALLY",{"$f":"IF(AND(RDate>=A31,RDate<B31),RDate+1,B31)","v":"2022-04-01"},{"$f":"IF(AND(RDate>=B31,RDate<C31),RDate+1,C31)","v":"2023-04-01"},{"$f":"IF(AND(RDate>=C31,RDate<D31),RDate+1,D31)","v":"2024-04-01"},{"$f":"IF(AND(RDate>=D31,RDate<E31),RDate+1,E31)","v":"2025-04-01"},{"$f":"IF(AND(RDate>=E31,RDate<F31),RDate+1,F31)","v":"2026-04-01"}]
[null,{"$f":"YEAR(B31)&\"/\"&RIGHT(YEAR(B31)+1,2)","v":"2022/23"},{"$f":"YEAR(C31)&\"/\"&RIGHT(YEAR(C31)+1,2)","v":"2023/24"},"2024/25","2025/26"]
["AO",{"$f":"COUNTIFS(Data!$U$3:$U$99780,\">=\"&B$32,Data!$U$3:$U$99780,\"<\"&C$32,Data!$AE$3:$AE$99780,TRUE)","v":0},{"$f":"COUNTIFS(Data!$U$3:$U$99780,\">=\"&C$32,Data!$U$3:$U$99780,\"<\"&D$32,Data!$AE$3:$AE$99780,TRUE)","v":0},{"$f":"COUNTIFS(Data!$U$3:$U$99780,\">=\"&D$32,Data!$U$3:$U$99780,\"<\"&E$32,Data!$AE$3:$AE$99780,TRUE)","v":0},{"$f":"COUNTIFS(Data!$U$3:$U$99780,\">=\"&E$32,Data!$U$3:$U$99780,\"<\"&F$32,Data!$AE$3:$AE$99780,TRUE)","v":0}]
["Placement",{"$f":"COUNTIFS(Data!$S$3:$S$99780,\">=\"&B$32,Data!$S$3:$S$99780,\"<\"&C$32,Data!$AE$3:$AE$99780,TRUE)","v":0},{"$f":"COUNTIFS(Data!$S$3:$S$99780,\">=\"&C$32,Data!$S$3:$S$99780,\"<\"&D$32,Data!$AE$3:$AE$99780,TRUE)","v":0},{"$f":"COUNTIFS(Data!$S$3:$S$99780,\">=\"&D$32,Data!$S$3:$S$99780,\"<\"&E$32,Data!$AE$3:$AE$99780,TRUE)","v":0},{"$f":"COUNTIFS(Data!$S$3:$S$99780,\">=\"&E$32,Data!$S$3:$S$99780,\"<\"&F$32,Data!$AE$3:$AE$99780,TRUE)","v":0}]
["Matches",{"$f":"COUNTIFS(Data!$R$3:$R$99780,\">=\"&B$32,Data!$R$3:$R$99780,\"<\"&C$32,Data!$AE$3:$AE$99780,TRUE)","v":0},{"$f":"COUNTIFS(Data!$R$3:$R$99780,\">=\"&C$32,Data!$R$3:$R$99780,\"<\"&D$32,Data!$AE$3:$AE$99780,TRUE)","v":0},{"$f":"COUNTIFS(Data!$R$3:$R$99780,\">=\"&D$32,Data!$R$3:$R$99780,\"<\"&E$32,Data!$AE$3:$AE$99780,TRUE)","v":0},{"$f":"COUNTIFS(Data!$R$3:$R$99780,\">=\"&E$32,Data!$R$3:$R$99780,\"<\"&F$32,Data!$AE$3:$AE$99780,TRUE)","v":0}]
["Approvals",{"$f":"COUNTIFS(Data!$Q$3:$Q$99780,\">=\"&B$32,Data!$Q$3:$Q$99780,\"<\"&C$32,Data!$AE$3:$AE$99780,TRUE)","v":0},{"$f":"COUNTIFS(Data!$Q$3:$Q$99780,\">=\"&C$32,Data!$Q$3:$Q$99780,\"<\"&D$32,Data!$AE$3:$AE$99780,TRUE)","v":0},{"$f":"COUNTIFS(Data!$Q$3:$Q$99780,\">=\"&D$32,Data!$Q$3:$Q$99780,\"<\"&E$32,Data!$AE$3:$AE$99780,TRUE)","v":0},{"$f":"COUNTIFS(Data!$Q$3:$Q$99780,\">=\"&E$32,Data!$Q$3:$Q$99780,\"<\"&F$32,Data!$AE$3:$AE$99780,TRUE)","v":0}]
["S2 start",{"$f":"COUNTIFS(Data!$P$3:$P$99780,\">=\"&B$32,Data!$P$3:$P$99780,\"<\"&C$32,Data!$AE$3:$AE$99780,TRUE)","v":0},{"$f":"COUNTIFS(Data!$P$3:$P$99780,\">=\"&C$32,Data!$P$3:$P$99780,\"<\"&D$32,Data!$AE$3:$AE$99780,TRUE)","v":0},{"$f":"COUNTIFS(Data!$P$3:$P$99780,\">=\"&D$32,Data!$P$3:$P$99780,\"<\"&E$32,Data!$AE$3:$AE$99780,TRUE)","v":0},{"$f":"COUNTIFS(Data!$P$3:$P$99780,\">=\"&E$32,Data!$P$3:$P$99780,\"<\"&F$32,Data!$AE$3:$AE$99780,TRUE)","v":0}]
["S1 end",{"$f":"COUNTIFS(Data!$O$3:$O$99780,\">=\"&B$32,Data!$O$3:$O$99780,\"<\"&C$32,Data!$AE$3:$AE$99780,TRUE)","v":0},{"$f":"COUNTIFS(Data!$O$3:$O$99780,\">=\"&C$32,Data!$O$3:$O$99780,\"<\"&D$32,Data!$AE$3:$AE$99780,TRUE)","v":0},{"$f":"COUNTIFS(Data!$O$3:$O$99780,\">=\"&D$32,Data!$O$3:$O$99780,\"<\"&E$32,Data!$AE$3:$AE$99780,TRUE)","v":0},{"$f":"COUNTIFS(Data!$O$3:$O$99780,\">=\"&E$32,Data!$O$3:$O$99780,\"<\"&F$32,Data!$AE$3:$AE$99780,TRUE)","v":0}]
["S1 start",{"$f":"COUNTIFS(Data!$N$3:$N$99780,\">=\"&B$32,Data!$N$3:$N$99780,\"<\"&C$32,Data!$AE$3:$AE$99780,TRUE)","v":0},{"$f":"COUNTIFS(Data!$N$3:$N$99780,\">=\"&C$32,Data!$N$3:$N$99780,\"<\"&D$32,Data!$AE$3:$AE$99780,TRUE)","v":0},{"$f":"COUNTIFS(Data!$N$3:$N$99780,\">=\"&D$32,Data!$N$3:$N$99780,\"<\"&E$32,Data!$AE$3:$AE$99780,TRUE)","v":0},{"$f":"COUNTIFS(Data!$N$3:$N$99780,\">=\"&E$32,Data!$N$3:$N$99780,\"<\"&F$32,Data!$AE$3:$AE$99780,TRUE)","v":0}]
["Post-approval withdrawal",{"$f":"COUNTIFS(Data!$Q$3:$Q$99780,\"<>\",Data!$W$3:$W$99780,\"<\"&C$32,Data!$W$3:$W$99780,\">=\"&B$32,Data!$X$3:$X$99780,1,Data!$AE$3:$AE$99780,TRUE)","v":0},{"$f":"COUNTIFS(Data!$Q$3:$Q$99780,\"<>\",Data!$W$3:$W$99780,\"<\"&D$32,Data!$W$3:$W$99780,\">=\"&C$32,Data!$X$3:$X$99780,1,Data!$AE$3:$AE$99780,TRUE)","v":0},{"$f":"COUNTIFS(Data!$Q$3:$Q$99780,\"<>\",Data!$W$3:$W$99780,\"<\"&E$32,Data!$W$3:$W$99780,\">=\"&D$32,Data!$X$3:$X$99780,1,Data!$AE$3:$AE$99780,TRUE)","v":0},{"$f":"COUNTIFS(Data!$Q$3:$Q$99780,\"<>\",Data!$W$3:$W$99780,\"<\"&F$32,Data!$W$3:$W$99780,\">=\"&E$32,Data!$X$3:$X$99780,1,Data!$AE$3:$AE$99780,TRUE)","v":0}]
["Post-approval withdrawal (by year approved)",{"$f":"COUNTIFS(Data!$Q$3:$Q$99780,\">=\"&B$32,Data!$Q$3:$Q$99780,\"<\"&C$32,Data!$W$3:$W$99780,\"<>\",Data!$X$3:$X$99780,1,Data!$AE$3:$AE$99780,TRUE)","v":0},{"$f":"COUNTIFS(Data!$Q$3:$Q$99780,\">=\"&C$32,Data!$Q$3:$Q$99780,\"<\"&D$32,Data!$W$3:$W$99780,\"<>\",Data!$X$3:$X$99780,1,Data!$AE$3:$AE$99780,TRUE)","v":0},{"$f":"COUNTIFS(Data!$Q$3:$Q$99780,\">=\"&D$32,Data!$Q$3:$Q$99780,\"<\"&E$32,Data!$W$3:$W$99780,\"<>\",Data!$X$3:$X$99780,1,Data!$AE$3:$AE$99780,TRUE)","v":0},{"$f":"COUNTIFS(Data!$Q$3:$Q$99780,\">=\"&E$32,Data!$Q$3:$Q$99780,\"<\"&F$32,Data!$W$3:$W$99780,\"<>\",Data!$X$3:$X$99780,1,Data!$AE$3:$AE$99780,TRUE)","v":0}]
["S2 refusal/withdrawal",{"$f":"COUNTIFS(Data!$P$3:$P$99780,\"<>\",Data!$Q$3:$Q$99780,\"\",Data!$R$3:$R$99780,\"\",Data!$S$3:$S$99780,\"\",Data!$U$3:$U$99780,\"\",Data!$W$3:$W$99780,\"<\"&C$32,Data!$W$3:$W$99780,\">=\"&B$32,Data!$X$3:$X$99780,\"<>2\",Data!$AE$3:$AE$99780,TRUE)","v":0},{"$f":"COUNTIFS(Data!$P$3:$P$99780,\"<>\",Data!$Q$3:$Q$99780,\"\",Data!$R$3:$R$99780,\"\",Data!$S$3:$S$99780,\"\",Data!$U$3:$U$99780,\"\",Data!$W$3:$W$99780,\"<\"&D$32,Data!$W$3:$W$99780,\">=\"&C$32,Data!$X$3:$X$99780,\"<>2\",Data!$AE$3:$AE$99780,TRUE)","v":0},{"$f":"COUNTIFS(Data!$P$3:$P$99780,\"<>\",Data!$Q$3:$Q$99780,\"\",Data!$R$3:$R$99780,\"\",Data!$S$3:$S$99780,\"\",Data!$U$3:$U$99780,\"\",Data!$W$3:$W$99780,\"<\"&E$32,Data!$W$3:$W$99780,\">=\"&D$32,Data!$X$3:$X$99780,\"<>2\",Data!$AE$3:$AE$99780,TRUE)","v":0},{"$f":"COUNTIFS(Data!$P$3:$P$99780,\"<>\",Data!$Q$3:$Q$99780,\"\",Data!$R$3:$R$99780,\"\",Data!$S$3:$S$99780,\"\",Data!$U$3:$U$99780,\"\",Data!$W$3:$W$99780,\"<\"&F$32,Data!$W$3:$W$99780,\">=\"&E$32,Data!$X$3:$X$99780,\"<>2\",Data!$AE$3:$AE$99780,TRUE)","v":0}]
["S2 refusal/withdrawal (by start date)",{"$f":"COUNTIFS(Data!$P$3:$P$99780,\">=\"&B$32,Data!$P$3:$P$99780,\"<\"&C$32,Data!$W$3:$W$99780,\"<>\",Data!$X$3:$X$99780,\"<>2\",Data!$AE$3:$AE$99780,TRUE)","v":0},{"$f":"COUNTIFS(Data!$P$3:$P$99780,\">=\"&C$32,Data!$P$3:$P$99780,\"<\"&D$32,Data!$W$3:$W$99780,\"<>\",Data!$X$3:$X$99780,\"<>2\",Data!$AE$3:$AE$99780,TRUE)","v":0},{"$f":"COUNTIFS(Data!$P$3:$P$99780,\">=\"&D$32,Data!$P$3:$P$99780,\"<\"&E$32,Data!$W$3:$W$99780,\"<>\",Data!$X$3:$X$99780,\"<>2\",Data!$AE$3:$AE$99780,TRUE)","v":0},{"$f":"COUNTIFS(Data!$P$3:$P$99780,\">=\"&E$32,Data!$P$3:$P$99780,\"<\"&F$32,Data!$W$3:$W$99780,\"<>\",Data!$X$3:$X$99780,\"<>2\",Data!$AE$3:$AE$99780,TRUE)","v":0}]
["S1 refusal/withdrawal",{"$f":"COUNTIFS(Data!$N$3:$N$99780,\"<>\",Data!$O$3:$O$99780,\"\",Data!$P$3:$P$99780,\"\",Data!$Q$3:$Q$99780,\"\",Data!$R$3:$R$99780,\"\",Data!$S$3:$S$99780,\"\",Data!$U$3:$U$99780,\"\",Data!$W$3:$W$99780,\"<\"&C$32,Data!$W$3:$W$99780,\">=\"&B$32,Data!$X$3:$X$99780,\"<>2\",Data!$AE$3:$AE$99780,TRUE)","v":0},{"$f":"COUNTIFS(Data!$N$3:$N$99780,\"<>\",Data!$O$3:$O$99780,\"\",Data!$P$3:$P$99780,\"\",Data!$Q$3:$Q$99780,\"\",Data!$R$3:$R$99780,\"\",Data!$S$3:$S$99780,\"\",Data!$U$3:$U$99780,\"\",Data!$W$3:$W$99780,\"<\"&D$32,Data!$W$3:$W$99780,\">=\"&C$32,Data!$X$3:$X$99780,\"<>2\",Data!$AE$3:$AE$99780,TRUE)","v":0},{"$f":"COUNTIFS(Data!$N$3:$N$99780,\"<>\",Data!$O$3:$O$99780,\"\",Data!$P$3:$P$99780,\"\",Data!$Q$3:$Q$99780,\"\",Data!$R$3:$R$99780,\"\",Data!$S$3:$S$99780,\"\",Data!$U$3:$U$99780,\"\",Data!$W$3:$W$99780,\"<\"&E$32,Data!$W$3:$W$99780,\">=\"&D$32,Data!$X$3:$X$99780,\"<>2\",Data!$AE$3:$AE$99780,TRUE)","v":0},{"$f":"COUNTIFS(Data!$N$3:$N$99780,\"<>\",Data!$O$3:$O$99780,\"\",Data!$P$3:$P$99780,\"\",Data!$Q$3:$Q$99780,\"\",Data!$R$3:$R$99780,\"\",Data!$S$3:$S$99780,\"\",Data!$U$3:$U$99780,\"\",Data!$W$3:$W$99780,\"<\"&F$32,Data!$W$3:$W$99780,\">=\"&E$32,Data!$X$3:$X$99780,\"<>2\",Data!$AE$3:$AE$99780,TRUE)","v":0}]
["S1 refusal/withdrawal (by start date)",{"$f":"COUNTIFS(Data!$N$3:$N$99780,\">=\"&B$32,Data!$N$3:$N$99780,\"<\"&C$32,Data!$W$3:$W$99780,\"<>\",Data!$X$3:$X$99780,\"<>2\",Data!$AE$3:$AE$99780,TRUE)","v":0},{"$f":"COUNTIFS(Data!$N$3:$N$99780,\">=\"&C$32,Data!$N$3:$N$99780,\"<\"&D$32,Data!$W$3:$W$99780,\"<>\",Data!$X$3:$X$99780,\"<>2\",Data!$AE$3:$AE$99780,TRUE)","v":0},{"$f":"COUNTIFS(Data!$N$3:$N$99780,\">=\"&D$32,Data!$N$3:$N$99780,\"<\"&E$32,Data!$W$3:$W$99780,\"<>\",Data!$X$3:$X$99780,\"<>2\",Data!$AE$3:$AE$99780,TRUE)","v":0},{"$f":"COUNTIFS(Data!$N$3:$N$99780,\">=\"&E$32,Data!$N$3:$N$99780,\"<\"&F$32,Data!$W$3:$W$99780,\"<>\",Data!$X$3:$X$99780,\"<>2\",Data!$AE$3:$AE$99780,TRUE)","v":0}]
["S2 pending withdrawal (by S1 end date)",{"$f":"COUNTIFS(Data!$O$3:$O$99780,\">=\"&B$32,Data!$O$3:$O$99780,\"<\"&C$32,Data!$W$3:$W$99780,\"<>\",Data!$X$3:$X$99780,\"<>2\",Data!$AE$3:$AE$99780,TRUE)","v":0},{"$f":"COUNTIFS(Data!$O$3:$O$99780,\">=\"&C$32,Data!$O$3:$O$99780,\"<\"&D$32,Data!$W$3:$W$99780,\"<>\",Data!$X$3:$X$99780,\"<>2\",Data!$AE$3:$AE$99780,TRUE)","v":0},{"$f":"COUNTIFS(Data!$O$3:$O$99780,\">=\"&D$32,Data!$O$3:$O$99780,\"<\"&E$32,Data!$W$3:$W$99780,\"<>\",Data!$X$3:$X$99780,\"<>2\",Data!$AE$3:$AE$99780,TRUE)","v":0},{"$f":"COUNTIFS(Data!$O$3:$O$99780,\">=\"&E$32,Data!$O$3:$O$99780,\"<\"&F$32,Data!$W$3:$W$99780,\"<>\",Data!$X$3:$X$99780,\"<>2\",Data!$AE$3:$AE$99780,TRUE)","v":0}]
["Approved and waiting"]
[]
["12-MONTH ROLLING",{"$f":"B6","v":"2022-04-01"},{"$f":"C6","v":"2022-05-01"},"2022-06-01","2022-07-01","2022-08-01","2022-09-01","2022-10-01","2022-11-01","2022-12-01","2023-01-01","2023-02-01","2023-03-01","2023-04-01","2023-05-01","2023-06-01","2023-07-01","2023-08-01","2023-09-01","2023-10-01","2023-11-01","2023-12-01","2024-01-01","2024-02-01","2024-03-01","2024-04-01","2024-05-01","2024-06-01","2024-07-01","2024-08-01","2024-09-01","2024-10-01","2024-11-01","2024-12-01","2025-01-01","2025-02-01","2025-03-01","2025-04-01"]
[null,{"$f":"N6","v":"2023-04-01"},{"$f":"O6","v":"2023-05-01"},"2023-06-01","2023-07-01","2023-08-01","2023-09-01","2023-10-01","2023-11-01","2023-12-01","2024-01-01","2024-02-01","2024-03-01","2024-04-01","2024-05-01","2024-06-01","2024-07-01","2024-08-01","2024-09-01","2024-10-01","2024-11-01","2024-12-01","2025-01-01","2025-02-01","2025-03-01","2025-04-01","2025-05-01","2025-06-01","2025-07-01","2025-08-01","2025-09-01","2025-10-01","2025-11-01","2025-12-01","2026-01-01","2026-02-01",{"$f":"AW6","v":"2026-03-01"},{"$f":"AX6","v":"2026-04-01"}]
["AO",{"$f":"COUNTIFS(Data!$U$3:$U$99780,\">=\"&B50,Data!$U$3:$U$99780,\"<\"&B51,Data!$AE$3:$AE$99780,TRUE)","v":0},{"$f":"COUNTIFS(Data!$U$3:$U$99780,\">=\"&C50,Data!$U$3:$U$99780,\"<\"&C51,Data!$AE$3:$AE$99780,TRUE)","v":0},{"$f":"COUNTIFS(Data!$U$3:$U$99780,\">=\"&D50,Data!$U$3:$U$99780,\"<\"&D51,Data!$AE$3:$AE$99780,TRUE)","v":0},{"$f":"COUNTIFS(Data!$U$3:$U$99780,\">=\"&E50,Data!$U$3:$U$99780,\"<\"&E51,Data!$AE$3:$AE$99780,TRUE)","v":0},{"$f":"COUNTIFS(Data!$U$3:$U$99780,\">=\"&F50,Data!$U$3:$U$99780,\"<\"&F51,Data!$AE$3:$AE$99780,TRUE)","v":0},{"$f":"COUNTIFS(Data!$U$3:$U$99780,\">=\"&G50,Data!$U$3:$U$99780,\"<\"&G51,Data!$AE$3:$AE$99780,TRUE)","v":0},{"$f":"COUNTIFS(Data!$U$3:$U$99780,\">=\"&H50,Data!$U$3:$U$99780,\"<\"&H51,Data!$AE$3:$AE$99780,TRUE)","v":0},{"$f":"COUNTIFS(Data!$U$3:$U$99780,\">=\"&I50,Data!$U$3:$U$99780,\"<\"&I51,Data!$AE$3:$AE$99780,TRUE)","v":0},{"$f":"COUNTIFS(Data!$U$3:$U$99780,\">=\"&J50,Data!$U$3:$U$99780,\"<\"&J51,Data!$AE$3:$AE$99780,TRUE)","v":0},{"$f":"COUNTIFS(Data!$U$3:$U$99780,\">=\"&K50,Data!$U$3:$U$99780,\"<\"&K51,Data!$AE$3:$AE$99780,TRUE)","v":0},{"$f":"COUNTIFS(Data!$U$3:$U$99780,\">=\"&L50,Data!$U$3:$U$99780,\"<\"&L51,Data!$AE$3:$AE$99780,TRUE)","v":0},{"$f":"COUNTIFS(Data!$U$3:$U$99780,\">=\"&M50,Data!$U$3:$U$99780,\"<\"&M51,Data!$AE$3:$AE$99780,TRUE)","v":0},{"$f":"COUNTIFS(Data!$U$3:$U$99780,\">=\"&N50,Data!$U$3:$U$99780,\"<\"&N51,Data!$AE$3:$AE$99780,TRUE)","v":0},{"$f":"COUNTIFS(Data!$U$3:$U$99780,\">=\"&O50,Data!$U$3:$U$99780,\"<\"&O51,Data!$AE$3:$AE$99780,TRUE)","v":0},{"$f":"COUNTIFS(Data!$U$3:$U$99780,\">=\"&P50,Data!$U$3:$U$99780,\"<\"&P51,Data!$AE$3:$AE$99780,TRUE)","v":0},{"$f":"COUNTIFS(Data!$U$3:$U$99780,\">=\"&Q50,Data!$U$3:$U$99780,\"<\"&Q51,Data!$AE$3:$AE$99780,TRUE)","v":0},{"$f":"COUNTIFS(Data!$U$3:$U$99780,\">=\"&R50,Data!$U$3:$U$99780,\"<\"&R51,Data!$AE$3:$AE$99780,TRUE)","v":0},{"$f":"COUNTIFS(Data!$U$3:$U$99780,\">=\"&S50,Data!$U$3:$U$99780,\"<\"&S51,Data!$AE$3:$AE$99780,TRUE)","v":0},{"$f":"COUNTIFS(Data!$U$3:$U$99780,\">=\"&T50,Data!$U$3:$U$99780,\"<\"&T51,Data!$AE$3:$AE$99780,TRUE)","v":0},{"$f":"COUNTIFS(Data!$U$3:$U$99780,\">=\"&U50,Data!$U$3:$U$99780,\"<\"&U51,Data!$AE$3:$AE$99780,TRUE)","v":0},{"$f":"COUNTIFS(Data!$U$3:$U$99780,\">=\"&V50,Data!$U$3:$U$99780,\"<\"&V51,Data!$AE$3:$AE$99780,TRUE)","v":0},{"$f":"COUNTIFS(Data!$U$3:$U$99780,\">=\"&W50,Data!$U$3:$U$99780,\"<\"&W51,Data!$AE$3:$AE$99780,TRUE)","v":0},{"$f":"COUNTIFS(Data!$U$3:$U$99780,\">=\"&X50,Data!$U$3:$U$99780,\"<\"&X51,Data!$AE$3:$AE$99780,TRUE)","v":0},{"$f":"COUNTIFS(Data!$U$3:$U$99780,\">=\"&Y50,Data!$U$3:$U$99780,\"<\"&Y51,Data!$AE$3:$AE$99780,TRUE)","v":0},{"$f":"COUNTIFS(Data!$U$3:$U$99780,\">=\"&Z50,Data!$U$3:$U$99780,\"<\"&Z51,Data!$AE$3:$AE$99780,TRUE)","v":0},{"$f":"COUNTIFS(Data!$U$3:$U$99780,\">=\"&AA50,Data!$U$3:$U$99780,\"<\"&AA51,Data!$AE$3:$AE$99780,TRUE)","v":0},{"$f":"COUNTIFS(Data!$U$3:$U$99780,\">=\"&AB50,Data!$U$3:$U$99780,\"<\"&AB51,Data!$AE$3:$AE$99780,TRUE)","v":0},{"$f":"COUNTIFS(Data!$U$3:$U$99780,\">=\"&AC50,Data!$U$3:$U$99780,\"<\"&AC51,Data!$AE$3:$AE$99780,TRUE)","v":0},{"$f":"COUNTIFS(Data!$U$3:$U$99780,\">=\"&AD50,Data!$U$3:$U$99780,\"<\"&AD51,Data!$AE$3:$AE$99780,TRUE)","v":0},{"$f":"COUNTIFS(Data!$U$3:$U$99780,\">=\"&AE50,Data!$U$3:$U$99780,\"<\"&AE51,Data!$AE$3:$AE$99780,TRUE)","v":0},{"$f":"COUNTIFS(Data!$U$3:$U$99780,\">=\"&AF50,Data!$U$3:$U$99780,\"<\"&AF51,Data!$AE$3:$AE$99780,TRUE)","v":0},{"$f":"COUNTIFS(Data!$U$3:$U$99780,\">=\"&AG50,Data!$U$3:$U$99780,\"<\"&AG51,Data!$AE$3:$AE$99780,TRUE)","v":0},{"$f":"COUNTIFS(Data!$U$3:$U$99780,\">=\"&AH50,Data!$U$3:$U$99780,\"<\"&AH51,Data!$AE$3:$AE$99780,TRUE)","v":0},{"$f":"COUNTIFS(Data!$U$3:$U$99780,\">=\"&AI50,Data!$U$3:$U$99780,\"<\"&AI51,Data!$AE$3:$AE$99780,TRUE)","v":0},{"$f":"COUNTIFS(Data!$U$3:$U$99780,\">=\"&AJ50,Data!$U$3:$U$99780,\"<\"&AJ51,Data!$AE$3:$AE$99780,TRUE)","v":0},{"$f":"COUNTIFS(Data!$U$3:$U$99780,\">=\"&AK50,Data!$U$3:$U$99780,\"<\"&AK51,Data!$AE$3:$AE$99780,TRUE)","v":0},{"$f":"COUNTIFS(Data!$U$3:$U$99780,\">=\"&AL50,Data!$U$3:$U$99780,\"<\"&AL51,Data!$AE$3:$AE$99780,TRUE)","v":0}]
["Placement",{"$f":"COUNTIFS(Data!$S$3:$S$99780,\">=\"&B50,Data!$S$3:$S$99780,\"<\"&B51,Data!$AE$3:$AE$99780,TRUE)","v":0},{"$f":"COUNTIFS(Data!$S$3:$S$99780,\">=\"&C50,Data!$S$3:$S$99780,\"<\"&C51,Data!$AE$3:$AE$99780,TRUE)","v":0},{"$f":"COUNTIFS(Data!$S$3:$S$99780,\">=\"&D50,Data!$S$3:$S$99780,\"<\"&D51,Data!$AE$3:$AE$99780,TRUE)","v":0},{"$f":"COUNTIFS(Data!$S$3:$S$99780,\">=\"&E50,Data!$S$3:$S$99780,\"<\"&E51,Data!$AE$3:$AE$99780,TRUE)","v":0},{"$f":"COUNTIFS(Data!$S$3:$S$99780,\">=\"&F50,Data!$S$3:$S$99780,\"<\"&F51,Data!$AE$3:$AE$99780,TRUE)","v":0},{"$f":"COUNTIFS(Data!$S$3:$S$99780,\">=\"&G50,Data!$S$3:$S$99780,\"<\"&G51,Data!$AE$3:$AE$99780,TRUE)","v":0},{"$f":"COUNTIFS(Data!$S$3:$S$99780,\">=\"&H50,Data!$S$3:$S$99780,\"<\"&H51,Data!$AE$3:$AE$99780,TRUE)","v":0},{"$f":"COUNTIFS(Data!$S$3:$S$99780,\">=\"&I50,Data!$S$3:$S$99780,\"<\"&I51,Data!$AE$3:$AE$99780,TRUE)","v":0},{"$f":"COUNTIFS(Data!$S$3:$S$99780,\">=\"&J50,Data!$S$3:$S$99780,\"<\"&J51,Data!$AE$3:$AE$99780,TRUE)","v":0},{"$f":"COUNTIFS(Data!$S$3:$S$99780,\">=\"&K50,Data!$S$3:$S$99780,\"<\"&K51,Data!$AE$3:$AE$99780,TRUE)","v":0},{"$f":"COUNTIFS(Data!$S$3:$S$99780,\">=\"&L50,Data!$S$3:$S$99780,\"<\"&L51,Data!$AE$3:$AE$99780,TRUE)","v":0},{"$f":"COUNTIFS(Data!$S$3:$S$99780,\">=\"&M50,Data!$S$3:$S$99780,\"<\"&M51,Data!$AE$3:$AE$99780,TRUE)","v":0},{"$f":"COUNTIFS(Data!$S$3:$S$99780,\">=\"&N50,Data!$S$3:$S$99780,\"<\"&N51,Data!$AE$3:$AE$99780,TRUE)","v":0},{"$f":"COUNTIFS(Data!$S$3:$S$99780,\">=\"&O50,Data!$S$3:$S$99780,\"<\"&O51,Data!$AE$3:$AE$99780,TRUE)","v":0},{"$f":"COUNTIFS(Data!$S$3:$S$99780,\">=\"&P50,Data!$S$3:$S$99780,\"<\"&P51,Data!$AE$3:$AE$99780,TRUE)","v":0},{"$f":"COUNTIFS(Data!$S$3:$S$99780,\">=\"&Q50,Data!$S$3:$S$99780,\"<\"&Q51,Data!$AE$3:$AE$99780,TRUE)","v":0},{"$f":"COUNTIFS(Data!$S$3:$S$99780,\">=\"&R50,Data!$S$3:$S$99780,\"<\"&R51,Data!$AE$3:$AE$99780,TRUE)","v":0},{"$f":"COUNTIFS(Data!$S$3:$S$99780,\">=\"&S50,Data!$S$3:$S$99780,\"<\"&S51,Data!$AE$3:$AE$99780,TRUE)","v":0},{"$f":"COUNTIFS(Data!$S$3:$S$99780,\">=\"&T50,Data!$S$3:$S$99780,\"<\"&T51,Data!$AE$3:$AE$99780,TRUE)","v":0},{"$f":"COUNTIFS(Data!$S$3:$S$99780,\">=\"&U50,Data!$S$3:$S$99780,\"<\"&U51,Data!$AE$3:$AE$99780,TRUE)","v":0},{"$f":"COUNTIFS(Data!$S$3:$S$99780,\">=\"&V50,Data!$S$3:$S$99780,\"<\"&V51,Data!$AE$3:$AE$99780,TRUE)","v":0},{"$f":"COUNTIFS(Data!$S$3:$S$99780,\">=\"&W50,Data!$S$3:$S$99780,\"<\"&W51,Data!$AE$3:$AE$99780,TRUE)","v":0},{"$f":"COUNTIFS(Data!$S$3:$S$99780,\">=\"&X50,Data!$S$3:$S$99780,\"<\"&X51,Data!$AE$3:$AE$99780,TRUE)","v":0},{"$f":"COUNTIFS(Data!$S$3:$S$99780,\">=\"&Y50,Data!$S$3:$S$99780,\"<\"&Y51,Data!$AE$3:$AE$99780,TRUE)","v":0},{"$f":"COUNTIFS(Data!$S$3:$S$99780,\">=\"&Z50,Data!$S$3:$S$99780,\"<\"&Z51,Data!$AE$3:$AE$99780,TRUE)","v":0},{"$f":"COUNTIFS(Data!$S$3:$S$99780,\">=\"&AA50,Data!$S$3:$S$99780,\"<\"&AA51,Data!$AE$3:$AE$99780,TRUE)","v":0},{"$f":"COUNTIFS(Data!$S$3:$S$99780,\">=\"&AB50,Data!$S$3:$S$99780,\"<\"&AB51,Data!$AE$3:$AE$99780,TRUE)","v":0},{"$f":"COUNTIFS(Data!$S$3:$S$99780,\">=\"&AC50,Data!$S$3:$S$99780,\"<\"&AC51,Data!$AE$3:$AE$99780,TRUE)","v":0},{"$f":"COUNTIFS(Data!$S$3:$S$99780,\">=\"&AD50,Data!$S$3:$S$99780,\"<\"&AD51,Data!$AE$3:$AE$99780,TRUE)","v":0},{"$f":"COUNTIFS(Data!$S$3:$S$99780,\">=\"&AE50,Data!$S$3:$S$99780,\"<\"&AE51,Data!$AE$3:$AE$99780,TRUE)","v":0},{"$f":"COUNTIFS(Data!$S$3:$S$99780,\">=\"&AF50,Data!$S$3:$S$99780,\"<\"&AF51,Data!$AE$3:$AE$99780,TRUE)","v":0},{"$f":"COUNTIFS(Data!$S$3:$S$99780,\">=\"&AG50,Data!$S$3:$S$99780,\"<\"&AG51,Data!$AE$3:$AE$99780,TRUE)","v":0},{"$f":"COUNTIFS(Data!$S$3:$S$99780,\">=\"&AH50,Data!$S$3:$S$99780,\"<\"&AH51,Data!$AE$3:$AE$99780,TRUE)","v":0},{"$f":"COUNTIFS(Data!$S$3:$S$99780,\">=\"&AI50,Data!$S$3:$S$99780,\"<\"&AI51,Data!$AE$3:$AE$99780,TRUE)","v":0},{"$f":"COUNTIFS(Data!$S$3:$S$99780,\">=\"&AJ50,Data!$S$3:$S$99780,\"<\"&AJ51,Data!$AE$3:$AE$99780,TRUE)","v":0},{"$f":"COUNTIFS(Data!$S$3:$S$99780,\">=\"&AK50,Data!$S$3:$S$99780,\"<\"&AK51,Data!$AE$3:$AE$99780,TRUE)","v":0},{"$f":"COUNTIFS(Data!$S$3:$S$99780,\">=\"&AL50,Data!$S$3:$S$99780,\"<\"&AL51,Data!$AE$3:$AE$99780,TRUE)","v":0}]
["Matches",{"$f":"COUNTIFS(Data!$R$3:$R$99780,\">=\"&B50,Data!$R$3:$R$99780,\"<\"&B51,Data!$AE$3:$AE$99780,TRUE)","v":0},{"$f":"COUNTIFS(Data!$R$3:$R$99780,\">=\"&C50,Data!$R$3:$R$99780,\"<\"&C51,Data!$AE$3:$AE$99780,TRUE)","v":0},{"$f":"COUNTIFS(Data!$R$3:$R$99780,\">=\"&D50,Data!$R$3:$R$99780,\"<\"&D51,Data!$AE$3:$AE$99780,TRUE)","v":0},{"$f":"COUNTIFS(Data!$R$3:$R$99780,\">=\"&E50,Data!$R$3:$R$99780,\"<\"&E51,Data!$AE$3:$AE$99780,TRUE)","v":0},{"$f":"COUNTIFS(Data!$R$3:$R$99780,\">=\"&F50,Data!$R$3:$R$99780,\"<\"&F51,Data!$AE$3:$AE$99780,TRUE)","v":0},{"$f":"COUNTIFS(Data!$R$3:$R$99780,\">=\"&G50,Data!$R$3:$R$99780,\"<\"&G51,Data!$AE$3:$AE$99780,TRUE)","v":0},{"$f":"COUNTIFS(Data!$R$3:$R$99780,\">=\"&H50,Data!$R$3:$R$99780,\"<\"&H51,Data!$AE$3:$AE$99780,TRUE)","v":0},{"$f":"COUNTIFS(Data!$R$3:$R$99780,\">=\"&I50,Data!$R$3:$R$99780,\"<\"&I51,Data!$AE$3:$AE$99780,TRUE)","v":0},{"$f":"COUNTIFS(Data!$R$3:$R$99780,\">=\"&J50,Data!$R$3:$R$99780,\"<\"&J51,Data!$AE$3:$AE$99780,TRUE)","v":0},{"$f":"COUNTIFS(Data!$R$3:$R$99780,\">=\"&K50,Data!$R$3:$R$99780,\"<\"&K51,Data!$AE$3:$AE$99780,TRUE)","v":0},{"$f":"COUNTIFS(Data!$R$3:$R$99780,\">=\"&L50,Data!$R$3:$R$99780,\"<\"&L51,Data!$AE$3:$AE$99780,TRUE)","v":0},{"$f":"COUNTIFS(Data!$R$3:$R$99780,\">=\"&M50,Data!$R$3:$R$99780,\"<\"&M51,Data!$AE$3:$AE$99780,TRUE)","v":0},{"$f":"COUNTIFS(Data!$R$3:$R$99780,\">=\"&N50,Data!$R$3:$R$99780,\"<\"&N51,Data!$AE$3:$AE$99780,TRUE)","v":0},{"$f":"COUNTIFS(Data!$R$3:$R$99780,\">=\"&O50,Data!$R$3:$R$99780,\"<\"&O51,Data!$AE$3:$AE$99780,TRUE)","v":0},{"$f":"COUNTIFS(Data!$R$3:$R$99780,\">=\"&P50,Data!$R$3:$R$99780,\"<\"&P51,Data!$AE$3:$AE$99780,TRUE)","v":0},{"$f":"COUNTIFS(Data!$R$3:$R$99780,\">=\"&Q50,Data!$R$3:$R$99780,\"<\"&Q51,Data!$AE$3:$AE$99780,TRUE)","v":0},{"$f":"COUNTIFS(Data!$R$3:$R$99780,\">=\"&R50,Data!$R$3:$R$99780,\"<\"&R51,Data!$AE$3:$AE$99780,TRUE)","v":0},{"$f":"COUNTIFS(Data!$R$3:$R$99780,\">=\"&S50,Data!$R$3:$R$99780,\"<\"&S51,Data!$AE$3:$AE$99780,TRUE)","v":0},{"$f":"COUNTIFS(Data!$R$3:$R$99780,\">=\"&T50,Data!$R$3:$R$99780,\"<\"&T51,Data!$AE$3:$AE$99780,TRUE)","v":0},{"$f":"COUNTIFS(Data!$R$3:$R$99780,\">=\"&U50,Data!$R$3:$R$99780,\"<\"&U51,Data!$AE$3:$AE$99780,TRUE)","v":0},{"$f":"COUNTIFS(Data!$R$3:$R$99780,\">=\"&V50,Data!$R$3:$R$99780,\"<\"&V51,Data!$AE$3:$AE$99780,TRUE)","v":0},{"$f":"COUNTIFS(Data!$R$3:$R$99780,\">=\"&W50,Data!$R$3:$R$99780,\"<\"&W51,Data!$AE$3:$AE$99780,TRUE)","v":0},{"$f":"COUNTIFS(Data!$R$3:$R$99780,\">=\"&X50,Data!$R$3:$R$99780,\"<\"&X51,Data!$AE$3:$AE$99780,TRUE)","v":0},{"$f":"COUNTIFS(Data!$R$3:$R$99780,\">=\"&Y50,Data!$R$3:$R$99780,\"<\"&Y51,Data!$AE$3:$AE$99780,TRUE)","v":0},{"$f":"COUNTIFS(Data!$R$3:$R$99780,\">=\"&Z50,Data!$R$3:$R$99780,\"<\"&Z51,Data!$AE$3:$AE$99780,TRUE)","v":0},{"$f":"COUNTIFS(Data!$R$3:$R$99780,\">=\"&AA50,Data!$R$3:$R$99780,\"<\"&AA51,Data!$AE$3:$AE$99780,TRUE)","v":0},{"$f":"COUNTIFS(Data!$R$3:$R$99780,\">=\"&AB50,Data!$R$3:$R$99780,\"<\"&AB51,Data!$AE$3:$AE$99780,TRUE)","v":0},{"$f":"COUNTIFS(Data!$R$3:$R$99780,\">=\"&AC50,Data!$R$3:$R$99780,\"<\"&AC51,Data!$AE$3:$AE$99780,TRUE)","v":0},{"$f":"COUNTIFS(Data!$R$3:$R$99780,\">=\"&AD50,Data!$R$3:$R$99780,\"<\"&AD51,Data!$AE$3:$AE$99780,TRUE)","v":0},{"$f":"COUNTIFS(Data!$R$3:$R$99780,\">=\"&AE50,Data!$R$3:$R$99780,\"<\"&AE51,Data!$AE$3:$AE$99780,TRUE)","v":0},{"$f":"COUNTIFS(Data!$R$3:$R$99780,\">=\"&AF50,Data!$R$3:$R$99780,\"<\"&AF51,Data!$AE$3:$AE$99780,TRUE)","v":0},{"$f":"COUNTIFS(Data!$R$3:$R$99780,\">=\"&AG50,Data!$R$3:$R$99780,\"<\"&AG51,Data!$AE$3:$AE$99780,TRUE)","v":0},{"$f":"COUNTIFS(Data!$R$3:$R$99780,\">=\"&AH50,Data!$R$3:$R$99780,\"<\"&AH51,Data!$AE$3:$AE$99780,TRUE)","v":0},{"$f":"COUNTIFS(Data!$R$3:$R$99780,\">=\"&AI50,Data!$R$3:$R$99780,\"<\"&AI51,Data!$AE$3:$AE$99780,TRUE)","v":0},{"$f":"COUNTIFS(Data!$R$3:$R$99780,\">=\"&AJ50,Data!$R$3:$R$99780,\"<\"&AJ51,Data!$AE$3:$AE$99780,TRUE)","v":0},{"$f":"COUNTIFS(Data!$R$3:$R$99780,\">=\"&AK50,Data!$R$3:$R$99780,\"<\"&AK51,Data!$AE$3:$AE$99780,TRUE)","v":0},{"$f":"COUNTIFS(Data!$R$3:$R$99780,\">=\"&AL50,Data!$R$3:$R$99780,\"<\"&AL51,Data!$AE$3:$AE$99780,TRUE)","v":0}]
["Approvals",{"$f":"COUNTIFS(Data!$Q$3:$Q$99780,\">=\"&B50,Data!$Q$3:$Q$99780,\"<\"&B51,Data!$AE$3:$AE$99780,TRUE)","v":0},{"$f":"COUNTIFS(Data!$Q$3:$Q$99780,\">=\"&C50,Data!$Q$3:$Q$99780,\"<\"&C51,Data!$AE$3:$AE$99780,TRUE)","v":0},{"$f":"COUNTIFS(Data!$Q$3:$Q$99780,\">=\"&D50,Data!$Q$3:$Q$99780,\"<\"&D51,Data!$AE$3:$AE$99780,TRUE)","v":0},{"$f":"COUNTIFS(Data!$Q$3:$Q$99780,\">=\"&E50,Data!$Q$3:$Q$99780,\"<\"&E51,Data!$AE$3:$AE$99780,TRUE)","v":0},{"$f":"COUNTIFS(Data!$Q$3:$Q$99780,\">=\"&F50,Data!$Q$3:$Q$99780,\"<\"&F51,Data!$AE$3:$AE$99780,TRUE)","v":0},{"$f":"COUNTIFS(Data!$Q$3:$Q$99780,\">=\"&G50,Data!$Q$3:$Q$99780,\"<\"&G51,Data!$AE$3:$AE$99780,TRUE)","v":0},{"$f":"COUNTIFS(Data!$Q$3:$Q$99780,\">=\"&H50,Data!$Q$3:$Q$99780,\"<\"&H51,Data!$AE$3:$AE$99780,TRUE)","v":0},{"$f":"COUNTIFS(Data!$Q$3:$Q$99780,\">=\"&I50,Data!$Q$3:$Q$99780,\"<\"&I51,Data!$AE$3:$AE$99780,TRUE)","v":0},{"$f":"COUNTIFS(Data!$Q$3:$Q$99780,\">=\"&J50,Data!$Q$3:$Q$99780,\"<\"&J51,Data!$AE$3:$AE$99780,TRUE)","v":0},{"$f":"COUNTIFS(Data!$Q$3:$Q$99780,\">=\"&K50,Data!$Q$3:$Q$99780,\"<\"&K51,Data!$AE$3:$AE$99780,TRUE)","v":0},{"$f":"COUNTIFS(Data!$Q$3:$Q$99780,\">=\"&L50,Data!$Q$3:$Q$99780,\"<\"&L51,Data!$AE$3:$AE$99780,TRUE)","v":0},{"$f":"COUNTIFS(Data!$Q$3:$Q$99780,\">=\"&M50,Data!$Q$3:$Q$99780,\"<\"&M51,Data!$AE$3:$AE$99780,TRUE)","v":0},{"$f":"COUNTIFS(Data!$Q$3:$Q$99780,\">=\"&N50,Data!$Q$3:$Q$99780,\"<\"&N51,Data!$AE$3:$AE$99780,TRUE)","v":0},{"$f":"COUNTIFS(Data!$Q$3:$Q$99780,\">=\"&O50,Data!$Q$3:$Q$99780,\"<\"&O51,Data!$AE$3:$AE$99780,TRUE)","v":0},{"$f":"COUNTIFS(Data!$Q$3:$Q$99780,\">=\"&P50,Data!$Q$3:$Q$99780,\"<\"&P51,Data!$AE$3:$AE$99780,TRUE)","v":0},{"$f":"COUNTIFS(Data!$Q$3:$Q$99780,\">=\"&Q50,Data!$Q$3:$Q$99780,\"<\"&Q51,Data!$AE$3:$AE$99780,TRUE)","v":0},{"$f":"COUNTIFS(Data!$Q$3:$Q$99780,\">=\"&R50,Data!$Q$3:$Q$99780,\"<\"&R51,Data!$AE$3:$AE$99780,TRUE)","v":0},{"$f":"COUNTIFS(Data!$Q$3:$Q$99780,\">=\"&S50,Data!$Q$3:$Q$99780,\"<\"&S51,Data!$AE$3:$AE$99780,TRUE)","v":0},{"$f":"COUNTIFS(Data!$Q$3:$Q$99780,\">=\"&T50,Data!$Q$3:$Q$99780,\"<\"&T51,Data!$AE$3:$AE$99780,TRUE)","v":0},{"$f":"COUNTIFS(Data!$Q$3:$Q$99780,\">=\"&U50,Data!$Q$3:$Q$99780,\"<\"&U51,Data!$AE$3:$AE$99780,TRUE)","v":0},{"$f":"COUNTIFS(Data!$Q$3:$Q$99780,\">=\"&V50,Data!$Q$3:$Q$99780,\"<\"&V51,Data!$AE$3:$AE$99780,TRUE)","v":0},{"$f":"COUNTIFS(Data!$Q$3:$Q$99780,\">=\"&W50,Data!$Q$3:$Q$99780,\"<\"&W51,Data!$AE$3:$AE$99780,TRUE)","v":0},{"$f":"COUNTIFS(Data!$Q$3:$Q$99780,\">=\"&X50,Data!$Q$3:$Q$99780,\"<\"&X51,Data!$AE$3:$AE$99780,TRUE)","v":0},{"$f":"COUNTIFS(Data!$Q$3:$Q$99780,\">=\"&Y50,Data!$Q$3:$Q$99780,\"<\"&Y51,Data!$AE$3:$AE$99780,TRUE)","v":0},{"$f":"COUNTIFS(Data!$Q$3:$Q$99780,\">=\"&Z50,Data!$Q$3:$Q$99780,\"<\"&Z51,Data!$AE$3:$AE$99780,TRUE)","v":0},{"$f":"COUNTIFS(Data!$Q$3:$Q$99780,\">=\"&AA50,Data!$Q$3:$Q$99780,\"<\"&AA51,Data!$AE$3:$AE$99780,TRUE)","v":0},{"$f":"COUNTIFS(Data!$Q$3:$Q$99780,\">=\"&AB50,Data!$Q$3:$Q$99780,\"<\"&AB51,Data!$AE$3:$AE$99780,TRUE)","v":0},{"$f":"COUNTIFS(Data!$Q$3:$Q$99780,\">=\"&AC50,Data!$Q$3:$Q$99780,\"<\"&AC51,Data!$AE$3:$AE$99780,TRUE)","v":0},{"$f":"COUNTIFS(Data!$Q$3:$Q$99780,\">=\"&AD50,Data!$Q$3:$Q$99780,\"<\"&AD51,Data!$AE$3:$AE$99780,TRUE)","v":0},{"$f":"COUNTIFS(Data!$Q$3:$Q$99780,\">=\"&AE50,Data!$Q$3:$Q$99780,\"<\"&AE51,Data!$AE$3:$AE$99780,TRUE)","v":0},{"$f":"COUNTIFS(Data!$Q$3:$Q$99780,\">=\"&AF50,Data!$Q$3:$Q$99780,\"<\"&AF51,Data!$AE$3:$AE$99780,TRUE)","v":0},{"$f":"COUNTIFS(Data!$Q$3:$Q$99780,\">=\"&AG50,Data!$Q$3:$Q$99780,\"<\"&AG51,Data!$AE$3:$AE$99780,TRUE)","v":0},{"$f":"COUNTIFS(Data!$Q$3:$Q$99780,\">=\"&AH50,Data!$Q$3:$Q$99780,\"<\"&AH51,Data!$AE$3:$AE$99780,TRUE)","v":0},{"$f":"COUNTIFS(Data!$Q$3:$Q$99780,\">=\"&AI50,Data!$Q$3:$Q$99780,\"<\"&AI51,Data!$AE$3:$AE$99780,TRUE)","v":0},{"$f":"COUNTIFS(Data!$Q$3:$Q$99780,\">=\"&AJ50,Data!$Q$3:$Q$99780,\"<\"&AJ51,Data!$AE$3:$AE$99780,TRUE)","v":0},{"$f":"COUNTIFS(Data!$Q$3:$Q$99780,\">=\"&AK50,Data!$Q$3:$Q$99780,\"<\"&AK51,Data!$AE$3:$AE$99780,TRUE)","v":0},{"$f":"COUNTIFS(Data!$Q$3:$Q$99780,\">=\"&AL50,Data!$Q$3:$Q$99780,\"<\"&AL51,Data!$AE$3:$AE$99780,TRUE)","v":0}]
["S2 start",{"$f":"COUNTIFS(Data!$P$3:$P$99780,\">=\"&B50,Data!$P$3:$P$99780,\"<\"&B51,Data!$AE$3:$AE$99780,TRUE)","v":0},{"$f":"COUNTIFS(Data!$P$3:$P$99780,\">=\"&C50,Data!$P$3:$P$99780,\"<\"&C51,Data!$AE$3:$AE$99780,TRUE)","v":0},{"$f":"COUNTIFS(Data!$P$3:$P$99780,\">=\"&D50,Data!$P$3:$P$99780,\"<\"&D51,Data!$AE$3:$AE$99780,TRUE)","v":0},{"$f":"COUNTIFS(Data!$P$3:$P$99780,\">=\"&E50,Data!$P$3:$P$99780,\"<\"&E51,Data!$AE$3:$AE$99780,TRUE)","v":0},{"$f":"COUNTIFS(Data!$P$3:$P$99780,\">=\"&F50,Data!$P$3:$P$99780,\"<\"&F51,Data!$AE$3:$AE$99780,TRUE)","v":0},{"$f":"COUNTIFS(Data!$P$3:$P$99780,\">=\"&G50,Data!$P$3:$P$99780,\"<\"&G51,Data!$AE$3:$AE$99780,TRUE)","v":0},{"$f":"COUNTIFS(Data!$P$3:$P$99780,\">=\"&H50,Data!$P$3:$P$99780,\"<\"&H51,Data!$AE$3:$AE$99780,TRUE)","v":0},{"$f":"COUNTIFS(Data!$P$3:$P$99780,\">=\"&I50,Data!$P$3:$P$99780,\"<\"&I51,Data!$AE$3:$AE$99780,TRUE)","v":0},{"$f":"COUNTIFS(Data!$P$3:$P$99780,\">=\"&J50,Data!$P$3:$P$99780,\"<\"&J51,Data!$AE$3:$AE$99780,TRUE)","v":0},{"$f":"COUNTIFS(Data!$P$3:$P$99780,\">=\"&K50,Data!$P$3:$P$99780,\"<\"&K51,Data!$AE$3:$AE$99780,TRUE)","v":0},{"$f":"COUNTIFS(Data!$P$3:$P$99780,\">=\"&L50,Data!$P$3:$P$99780,\"<\"&L51,Data!$AE$3:$AE$99780,TRUE)","v":0},{"$f":"COUNTIFS(Data!$P$3:$P$99780,\">=\"&M50,Data!$P$3:$P$99780,\"<\"&M51,Data!$AE$3:$AE$99780,TRUE)","v":0},{"$f":"COUNTIFS(Data!$P$3:$P$99780,\">=\"&N50,Data!$P$3:$P$99780,\"<\"&N51,Data!$AE$3:$AE$99780,TRUE)","v":0},{"$f":"COUNTIFS(Data!$P$3:$P$99780,\">=\"&O50,Data!$P$3:$P$99780,\"<\"&O51,Data!$AE$3:$AE$99780,TRUE)","v":0},{"$f":"COUNTIFS(Data!$P$3:$P$99780,\">=\"&P50,Data!$P$3:$P$99780,\"<\"&P51,Data!$AE$3:$AE$99780,TRUE)","v":0},{"$f":"COUNTIFS(Data!$P$3:$P$99780,\">=\"&Q50,Data!$P$3:$P$99780,\"<\"&Q51,Data!$AE$3:$AE$99780,TRUE)","v":0},{"$f":"COUNTIFS(Data!$P$3:$P$99780,\">=\"&R50,Data!$P$3:$P$99780,\"<\"&R51,Data!$AE$3:$AE$99780,TRUE)","v":0},{"$f":"COUNTIFS(Data!$P$3:$P$99780,\">=\"&S50,Data!$P$3:$P$99780,\"<\"&S51,Data!$AE$3:$AE$99780,TRUE)","v":0},{"$f":"COUNTIFS(Data!$P$3:$P$99780,\">=\"&T50,Data!$P$3:$P$99780,\"<\"&T51,Data!$AE$3:$AE$99780,TRUE)","v":0},{"$f":"COUNTIFS(Data!$P$3:$P$99780,\">=\"&U50,Data!$P$3:$P$99780,\"<\"&U51,Data!$AE$3:$AE$99780,TRUE)","v":0},{"$f":"COUNTIFS(Data!$P$3:$P$99780,\">=\"&V50,Data!$P$3:$P$99780,\"<\"&V51,Data!$AE$3:$AE$99780,TRUE)","v":0},{"$f":"COUNTIFS(Data!$P$3:$P$99780,\">=\"&W50,Data!$P$3:$P$99780,\"<\"&W51,Data!$AE$3:$AE$99780,TRUE)","v":0},{"$f":"COUNTIFS(Data!$P$3:$P$99780,\">=\"&X50,Data!$P$3:$P$99780,\"<\"&X51,Data!$AE$3:$AE$99780,TRUE)","v":0},{"$f":"COUNTIFS(Data!$P$3:$P$99780,\">=\"&Y50,Data!$P$3:$P$99780,\"<\"&Y51,Data!$AE$3:$AE$99780,TRUE)","v":0},{"$f":"COUNTIFS(Data!$P$3:$P$99780,\">=\"&Z50,Data!$P$3:$P$99780,\"<\"&Z51,Data!$AE$3:$AE$99780,TRUE)","v":0},{"$f":"COUNTIFS(Data!$P$3:$P$99780,\">=\"&AA50,Data!$P$3:$P$99780,\"<\"&AA51,Data!$AE$3:$AE$99780,TRUE)","v":0},{"$f":"COUNTIFS(Data!$P$3:$P$99780,\">=\"&AB50,Data!$P$3:$P$99780,\"<\"&AB51,Data!$AE$3:$AE$99780,TRUE)","v":0},{"$f":"COUNTIFS(Data!$P$3:$P$99780,\">=\"&AC50,Data!$P$3:$P$99780,\"<\"&AC51,Data!$AE$3:$AE$99780,TRUE)","v":0},{"$f":"COUNTIFS(Data!$P$3:$P$99780,\">=\"&AD50,Data!$P$3:$P$99780,\"<\"&AD51,Data!$AE$3:$AE$99780,TRUE)","v":0},{"$f":"COUNTIFS(Data!$P$3:$P$99780,\">=\"&AE50,Data!$P$3:$P$99780,\"<\"&AE51,Data!$AE$3:$AE$99780,TRUE)","v":0},{"$f":"COUNTIFS(Data!$P$3:$P$99780,\">=\"&AF50,Data!$P$3:$P$99780,\"<\"&AF51,Data!$AE$3:$AE$99780,TRUE)","v":0},{"$f":"COUNTIFS(Data!$P$3:$P$99780,\">=\"&AG50,Data!$P$3:$P$99780,\"<\"&AG51,Data!$AE$3:$AE$99780,TRUE)","v":0},{"$f":"COUNTIFS(Data!$P$3:$P$99780,\">=\"&AH50,Data!$P$3:$P$99780,\"<\"&AH51,Data!$AE$3:$AE$99780,TRUE)","v":0},{"$f":"COUNTIFS(Data!$P$3:$P$99780,\">=\"&AI50,Data!$P$3:$P$99780,\"<\"&AI51,Data!$AE$3:$AE$99780,TRUE)","v":0},{"$f":"COUNTIFS(Data!$P$3:$P$99780,\">=\"&AJ50,Data!$P$3:$P$99780,\"<\"&AJ51,Data!$AE$3:$AE$99780,TRUE)","v":0},{"$f":"COUNTIFS(Data!$P$3:$P$99780,\">=\"&AK50,Data!$P$3:$P$99780,\"<\"&AK51,Data!$AE$3:$AE$99780,TRUE)","v":0},{"$f":"COUNTIFS(Data!$P$3:$P$99780,\">=\"&AL50,Data!$P$3:$P$99780,\"<\"&AL51,Data!$AE$3:$AE$99780,TRUE)","v":0}]
["S1 end",{"$f":"COUNTIFS(Data!$O$3:$O$99780,\">=\"&B50,Data!$O$3:$O$99780,\"<\"&B51,Data!$AE$3:$AE$99780,TRUE)","v":0},{"$f":"COUNTIFS(Data!$O$3:$O$99780,\">=\"&C50,Data!$O$3:$O$99780,\"<\"&C51,Data!$AE$3:$AE$99780,TRUE)","v":0},{"$f":"COUNTIFS(Data!$O$3:$O$99780,\">=\"&D50,Data!$O$3:$O$99780,\"<\"&D51,Data!$AE$3:$AE$99780,TRUE)","v":0},{"$f":"COUNTIFS(Data!$O$3:$O$99780,\">=\"&E50,Data!$O$3:$O$99780,\"<\"&E51,Data!$AE$3:$AE$99780,TRUE)","v":0},{"$f":"COUNTIFS(Data!$O$3:$O$99780,\">=\"&F50,Data!$O$3:$O$99780,\"<\"&F51,Data!$AE$3:$AE$99780,TRUE)","v":0},{"$f":"COUNTIFS(Data!$O$3:$O$99780,\">=\"&G50,Data!$O$3:$O$99780,\"<\"&G51,Data!$AE$3:$AE$99780,TRUE)","v":0},{"$f":"COUNTIFS(Data!$O$3:$O$99780,\">=\"&H50,Data!$O$3:$O$99780,\"<\"&H51,Data!$AE$3:$AE$99780,TRUE)","v":0},{"$f":"COUNTIFS(Data!$O$3:$O$99780,\">=\"&I50,Data!$O$3:$O$99780,\"<\"&I51,Data!$AE$3:$AE$99780,TRUE)","v":0},{"$f":"COUNTIFS(Data!$O$3:$O$99780,\">=\"&J50,Data!$O$3:$O$99780,\"<\"&J51,Data!$AE$3:$AE$99780,TRUE)","v":0},{"$f":"COUNTIFS(Data!$O$3:$O$99780,\">=\"&K50,Data!$O$3:$O$99780,\"<\"&K51,Data!$AE$3:$AE$99780,TRUE)","v":0},{"$f":"COUNTIFS(Data!$O$3:$O$99780,\">=\"&L50,Data!$O$3:$O$99780,\"<\"&L51,Data!$AE$3:$AE$99780,TRUE)","v":0},{"$f":"COUNTIFS(Data!$O$3:$O$99780,\">=\"&M50,Data!$O$3:$O$99780,\"<\"&M51,Data!$AE$3:$AE$99780,TRUE)","v":0},{"$f":"COUNTIFS(Data!$O$3:$O$99780,\">=\"&N50,Data!$O$3:$O$99780,\"<\"&N51,Data!$AE$3:$AE$99780,TRUE)","v":0},{"$f":"COUNTIFS(Data!$O$3:$O$99780,\">=\"&O50,Data!$O$3:$O$99780,\"<\"&O51,Data!$AE$3:$AE$99780,TRUE)","v":0},{"$f":"COUNTIFS(Data!$O$3:$O$99780,\">=\"&P50,Data!$O$3:$O$99780,\"<\"&P51,Data!$AE$3:$AE$99780,TRUE)","v":0},{"$f":"COUNTIFS(Data!$O$3:$O$99780,\">=\"&Q50,Data!$O$3:$O$99780,\"<\"&Q51,Data!$AE$3:$AE$99780,TRUE)","v":0},{"$f":"COUNTIFS(Data!$O$3:$O$99780,\">=\"&R50,Data!$O$3:$O$99780,\"<\"&R51,Data!$AE$3:$AE$99780,TRUE)","v":0},{"$f":"COUNTIFS(Data!$O$3:$O$99780,\">=\"&S50,Data!$O$3:$O$99780,\"<\"&S51,Data!$AE$3:$AE$99780,TRUE)","v":0},{"$f":"COUNTIFS(Data!$O$3:$O$99780,\">=\"&T50,Data!$O$3:$O$99780,\"<\"&T51,Data!$AE$3:$AE$99780,TRUE)","v":0},{"$f":"COUNTIFS(Data!$O$3:$O$99780,\">=\"&U50,Data!$O$3:$O$99780,\"<\"&U51,Data!$AE$3:$AE$99780,TRUE)","v":0},{"$f":"COUNTIFS(Data!$O$3:$O$99780,\">=\"&V50,Data!$O$3:$O$99780,\"<\"&V51,Data!$AE$3:$AE$99780,TRUE)","v":0},{"$f":"COUNTIFS(Data!$O$3:$O$99780,\">=\"&W50,Data!$O$3:$O$99780,\"<\"&W51,Data!$AE$3:$AE$99780,TRUE)","v":0},{"$f":"COUNTIFS(Data!$O$3:$O$99780,\">=\"&X50,Data!$O$3:$O$99780,\"<\"&X51,Data!$AE$3:$AE$99780,TRUE)","v":0},{"$f":"COUNTIFS(Data!$O$3:$O$99780,\">=\"&Y50,Data!$O$3:$O$99780,\"<\"&Y51,Data!$AE$3:$AE$99780,TRUE)","v":0},{"$f":"COUNTIFS(Data!$O$3:$O$99780,\">=\"&Z50,Data!$O$3:$O$99780,\"<\"&Z51,Data!$AE$3:$AE$99780,TRUE)","v":0},{"$f":"COUNTIFS(Data!$O$3:$O$99780,\">=\"&AA50,Data!$O$3:$O$99780,\"<\"&AA51,Data!$AE$3:$AE$99780,TRUE)","v":0},{"$f":"COUNTIFS(Data!$O$3:$O$99780,\">=\"&AB50,Data!$O$3:$O$99780,\"<\"&AB51,Data!$AE$3:$AE$99780,TRUE)","v":0},{"$f":"COUNTIFS(Data!$O$3:$O$99780,\">=\"&AC50,Data!$O$3:$O$99780,\"<\"&AC51,Data!$AE$3:$AE$99780,TRUE)","v":0},{"$f":"COUNTIFS(Data!$O$3:$O$99780,\">=\"&AD50,Data!$O$3:$O$99780,\"<\"&AD51,Data!$AE$3:$AE$99780,TRUE)","v":0},{"$f":"COUNTIFS(Data!$O$3:$O$99780,\">=\"&AE50,Data!$O$3:$O$99780,\"<\"&AE51,Data!$AE$3:$AE$99780,TRUE)","v":0},{"$f":"COUNTIFS(Data!$O$3:$O$99780,\">=\"&AF50,Data!$O$3:$O$99780,\"<\"&AF51,Data!$AE$3:$AE$99780,TRUE)","v":0},{"$f":"COUNTIFS(Data!$O$3:$O$99780,\">=\"&AG50,Data!$O$3:$O$99780,\"<\"&AG51,Data!$AE$3:$AE$99780,TRUE)","v":0},{"$f":"COUNTIFS(Data!$O$3:$O$99780,\">=\"&AH50,Data!$O$3:$O$99780,\"<\"&AH51,Data!$AE$3:$AE$99780,TRUE)","v":0},{"$f":"COUNTIFS(Data!$O$3:$O$99780,\">=\"&AI50,Data!$O$3:$O$99780,\"<\"&AI51,Data!$AE$3:$AE$99780,TRUE)","v":0},{"$f":"COUNTIFS(Data!$O$3:$O$99780,\">=\"&AJ50,Data!$O$3:$O$99780,\"<\"&AJ51,Data!$AE$3:$AE$99780,TRUE)","v":0},{"$f":"COUNTIFS(Data!$O$3:$O$99780,\">=\"&AK50,Data!$O$3:$O$99780,\"<\"&AK51,Data!$AE$3:$AE$99780,TRUE)","v":0},{"$f":"COUNTIFS(Data!$O$3:$O$99780,\">=\"&AL50,Data!$O$3:$O$99780,\"<\"&AL51,Data!$AE$3:$AE$99780,TRUE)","v":0}]
["S1 start",{"$f":"COUNTIFS(Data!$N$3:$N$99780,\">=\"&B50,Data!$N$3:$N$99780,\"<\"&B51,Data!$AE$3:$AE$99780,TRUE)","v":0},{"$f":"COUNTIFS(Data!$N$3:$N$99780,\">=\"&C50,Data!$N$3:$N$99780,\"<\"&C51,Data!$AE$3:$AE$99780,TRUE)","v":0},{"$f":"COUNTIFS(Data!$N$3:$N$99780,\">=\"&D50,Data!$N$3:$N$99780,\"<\"&D51,Data!$AE$3:$AE$99780,TRUE)","v":0},{"$f":"COUNTIFS(Data!$N$3:$N$99780,\">=\"&E50,Data!$N$3:$N$99780,\"<\"&E51,Data!$AE$3:$AE$99780,TRUE)","v":0},{"$f":"COUNTIFS(Data!$N$3:$N$99780,\">=\"&F50,Data!$N$3:$N$99780,\"<\"&F51,Data!$AE$3:$AE$99780,TRUE)","v":0},{"$f":"COUNTIFS(Data!$N$3:$N$99780,\">=\"&G50,Data!$N$3:$N$99780,\"<\"&G51,Data!$AE$3:$AE$99780,TRUE)","v":0},{"$f":"COUNTIFS(Data!$N$3:$N$99780,\">=\"&H50,Data!$N$3:$N$99780,\"<\"&H51,Data!$AE$3:$AE$99780,TRUE)","v":0},{"$f":"COUNTIFS(Data!$N$3:$N$99780,\">=\"&I50,Data!$N$3:$N$99780,\"<\"&I51,Data!$AE$3:$AE$99780,TRUE)","v":0},{"$f":"COUNTIFS(Data!$N$3:$N$99780,\">=\"&J50,Data!$N$3:$N$99780,\"<\"&J51,Data!$AE$3:$AE$99780,TRUE)","v":0},{"$f":"COUNTIFS(Data!$N$3:$N$99780,\">=\"&K50,Data!$N$3:$N$99780,\"<\"&K51,Data!$AE$3:$AE$99780,TRUE)","v":0},{"$f":"COUNTIFS(Data!$N$3:$N$99780,\">=\"&L50,Data!$N$3:$N$99780,\"<\"&L51,Data!$AE$3:$AE$99780,TRUE)","v":0},{"$f":"COUNTIFS(Data!$N$3:$N$99780,\">=\"&M50,Data!$N$3:$N$99780,\"<\"&M51,Data!$AE$3:$AE$99780,TRUE)","v":0},{"$f":"COUNTIFS(Data!$N$3:$N$99780,\">=\"&N50,Data!$N$3:$N$99780,\"<\"&N51,Data!$AE$3:$AE$99780,TRUE)","v":0},{"$f":"COUNTIFS(Data!$N$3:$N$99780,\">=\"&O50,Data!$N$3:$N$99780,\"<\"&O51,Data!$AE$3:$AE$99780,TRUE)","v":0},{"$f":"COUNTIFS(Data!$N$3:$N$99780,\">=\"&P50,Data!$N$3:$N$99780,\"<\"&P51,Data!$AE$3:$AE$99780,TRUE)","v":0},{"$f":"COUNTIFS(Data!$N$3:$N$99780,\">=\"&Q50,Data!$N$3:$N$99780,\"<\"&Q51,Data!$AE$3:$AE$99780,TRUE)","v":0},{"$f":"COUNTIFS(Data!$N$3:$N$99780,\">=\"&R50,Data!$N$3:$N$99780,\"<\"&R51,Data!$AE$3:$AE$99780,TRUE)","v":0},{"$f":"COUNTIFS(Data!$N$3:$N$99780,\">=\"&S50,Data!$N$3:$N$99780,\"<\"&S51,Data!$AE$3:$AE$99780,TRUE)","v":0},{"$f":"COUNTIFS(Data!$N$3:$N$99780,\">=\"&T50,Data!$N$3:$N$99780,\"<\"&T51,Data!$AE$3:$AE$99780,TRUE)","v":0},{"$f":"COUNTIFS(Data!$N$3:$N$99780,\">=\"&U50,Data!$N$3:$N$99780,\"<\"&U51,Data!$AE$3:$AE$99780,TRUE)","v":0},{"$f":"COUNTIFS(Data!$N$3:$N$99780,\">=\"&V50,Data!$N$3:$N$99780,\"<\"&V51,Data!$AE$3:$AE$99780,TRUE)","v":0},{"$f":"COUNTIFS(Data!$N$3:$N$99780,\">=\"&W50,Data!$N$3:$N$99780,\"<\"&W51,Data!$AE$3:$AE$99780,TRUE)","v":0},{"$f":"COUNTIFS(Data!$N$3:$N$99780,\">=\"&X50,Data!$N$3:$N$99780,\"<\"&X51,Data!$AE$3:$AE$99780,TRUE)","v":0},{"$f":"COUNTIFS(Data!$N$3:$N$99780,\">=\"&Y50,Data!$N$3:$N$99780,\"<\"&Y51,Data!$AE$3:$AE$99780,TRUE)","v":0},{"$f":"COUNTIFS(Data!$N$3:$N$99780,\">=\"&Z50,Data!$N$3:$N$99780,\"<\"&Z51,Data!$AE$3:$AE$99780,TRUE)","v":0},{"$f":"COUNTIFS(Data!$N$3:$N$99780,\">=\"&AA50,Data!$N$3:$N$99780,\"<\"&AA51,Data!$AE$3:$AE$99780,TRUE)","v":0},{"$f":"COUNTIFS(Data!$N$3:$N$99780,\">=\"&AB50,Data!$N$3:$N$99780,\"<\"&AB51,Data!$AE$3:$AE$99780,TRUE)","v":0},{"$f":"COUNTIFS(Data!$N$3:$N$99780,\">=\"&AC50,Data!$N$3:$N$99780,\"<\"&AC51,Data!$AE$3:$AE$99780,TRUE)","v":0},{"$f":"COUNTIFS(Data!$N$3:$N$99780,\">=\"&AD50,Data!$N$3:$N$99780,\"<\"&AD51,Data!$AE$3:$AE$99780,TRUE)","v":0},{"$f":"COUNTIFS(Data!$N$3:$N$99780,\">=\"&AE50,Data!$N$3:$N$99780,\"<\"&AE51,Data!$AE$3:$AE$99780,TRUE)","v":0},{"$f":"COUNTIFS(Data!$N$3:$N$99780,\">=\"&AF50,Data!$N$3:$N$99780,\"<\"&AF51,Data!$AE$3:$AE$99780,TRUE)","v":0},{"$f":"COUNTIFS(Data!$N$3:$N$99780,\">=\"&AG50,Data!$N$3:$N$99780,\"<\"&AG51,Data!$AE$3:$AE$99780,TRUE)","v":0},{"$f":"COUNTIFS(Data!$N$3:$N$99780,\">=\"&AH50,Data!$N$3:$N$99780,\"<\"&AH51,Data!$AE$3:$AE$99780,TRUE)","v":0},{"$f":"COUNTIFS(Data!$N$3:$N$99780,\">=\"&AI50,Data!$N$3:$N$99780,\"<\"&AI51,Data!$AE$3:$AE$99780,TRUE)","v":0},{"$f":"COUNTIFS(Data!$N$3:$N$99780,\">=\"&AJ50,Data!$N$3:$N$99780,\"<\"&AJ51,Data!$AE$3:$AE$99780,TRUE)","v":0},{"$f":"COUNTIFS(Data!$N$3:$N$99780,\">=\"&AK50,Data!$N$3:$N$99780,\"<\"&AK51,Data!$AE$3:$AE$99780,TRUE)","v":0},{"$f":"COUNTIFS(Data!$N$3:$N$99780,\">=\"&AL50,Data!$N$3:$N$99780,\"<\"&AL51,Data!$AE$3:$AE$99780,TRUE)","v":0}]
["Post-approval withdrawal",{"$f":"COUNTIFS(Data!$Q$3:$Q$99780,\"<>\",Data!$W$3:$W$99780,\"<\"&B51,Data!$W$3:$W$99780,\">=\"&B50,Data!$X$3:$X$99780,1,Data!$AE$3:$AE$99780,TRUE)","v":0},{"$f":"COUNTIFS(Data!$Q$3:$Q$99780,\"<>\",Data!$W$3:$W$99780,\"<\"&C51,Data!$W$3:$W$99780,\">=\"&C50,Data!$X$3:$X$99780,1,Data!$AE$3:$AE$99780,TRUE)","v":0},{"$f":"COUNTIFS(Data!$Q$3:$Q$99780,\"<>\",Data!$W$3:$W$99780,\"<\"&D51,Data!$W$3:$W$99780,\">=\"&D50,Data!$X$3:$X$99780,1,Data!$AE$3:$AE$99780,TRUE)","v":0},{"$f":"COUNTIFS(Data!$Q$3:$Q$99780,\"<>\",Data!$W$3:$W$99780,\"<\"&E51,Data!$W$3:$W$99780,\">=\"&E50,Data!$X$3:$X$99780,1,Data!$AE$3:$AE$99780,TRUE)","v":0},{"$f":"COUNTIFS(Data!$Q$3:$Q$99780,\"<>\",Data!$W$3:$W$99780,\"<\"&F51,Data!$W$3:$W$99780,\">=\"&F50,Data!$X$3:$X$99780,1,Data!$AE$3:$AE$99780,TRUE)","v":0},{"$f":"COUNTIFS(Data!$Q$3:$Q$99780,\"<>\",Data!$W$3:$W$99780,\"<\"&G51,Data!$W$3:$W$99780,\">=\"&G50,Data!$X$3:$X$99780,1,Data!$AE$3:$AE$99780,TRUE)","v":0},{"$f":"COUNTIFS(Data!$Q$3:$Q$99780,\"<>\",Data!$W$3:$W$99780,\"<\"&H51,Data!$W$3:$W$99780,\">=\"&H50,Data!$X$3:$X$99780,1,Data!$AE$3:$AE$99780,TRUE)","v":0},{"$f":"COUNTIFS(Data!$Q$3:$Q$99780,\"<>\",Data!$W$3:$W$99780,\"<\"&I51,Data!$W$3:$W$99780,\">=\"&I50,Data!$X$3:$X$99780,1,Data!$AE$3:$AE$99780,TRUE)","v":0},{"$f":"COUNTIFS(Data!$Q$3:$Q$99780,\"<>\",Data!$W$3:$W$99780,\"<\"&J51,Data!$W$3:$W$99780,\">=\"&J50,Data!$X$3:$X$99780,1,Data!$AE$3:$AE$99780,TRUE)","v":0},{"$f":"COUNTIFS(Data!$Q$3:$Q$99780,\"<>\",Data!$W$3:$W$99780,\"<\"&K51,Data!$W$3:$W$99780,\">=\"&K50,Data!$X$3:$X$99780,1,Data!$AE$3:$AE$99780,TRUE)","v":0},{"$f":"COUNTIFS(Data!$Q$3:$Q$99780,\"<>\",Data!$W$3:$W$99780,\"<\"&L51,Data!$W$3:$W$99780,\">=\"&L50,Data!$X$3:$X$99780,1,Data!$AE$3:$AE$99780,TRUE)","v":0},{"$f":"COUNTIFS(Data!$Q$3:$Q$99780,\"<>\",Data!$W$3:$W$99780,\"<\"&M51,Data!$W$3:$W$99780,\">=\"&M50,Data!$X$3:$X$99780,1,Data!$AE$3:$AE$99780,TRUE)","v":0},{"$f":"COUNTIFS(Data!$Q$3:$Q$99780,\"<>\",Data!$W$3:$W$99780,\"<\"&N51,Data!$W$3:$W$99780,\">=\"&N50,Data!$X$3:$X$99780,1,Data!$AE$3:$AE$99780,TRUE)","v":0},{"$f":"COUNTIFS(Data!$Q$3:$Q$99780,\"<>\",Data!$W$3:$W$99780,\"<\"&O51,Data!$W$3:$W$99780,\">=\"&O50,Data!$X$3:$X$99780,1,Data!$AE$3:$AE$99780,TRUE)","v":0},{"$f":"COUNTIFS(Data!$Q$3:$Q$99780,\"<>\",Data!$W$3:$W$99780,\"<\"&P51,Data!$W$3:$W$99780,\">=\"&P50,Data!$X$3:$X$99780,1,Data!$AE$3:$AE$99780,TRUE)","v":0},{"$f":"COUNTIFS(Data!$Q$3:$Q$99780,\"<>\",Data!$W$3:$W$99780,\"<\"&Q51,Data!$W$3:$W$99780,\">=\"&Q50,Data!$X$3:$X$99780,1,Data!$AE$3:$AE$99780,TRUE)","v":0},{"$f":"COUNTIFS(Data!$Q$3:$Q$99780,\"<>\",Data!$W$3:$W$99780,\"<\"&R51,Data!$W$3:$W$99780,\">=\"&R50,Data!$X$3:$X$99780,1,Data!$AE$3:$AE$99780,TRUE)","v":0},{"$f":"COUNTIFS(Data!$Q$3:$Q$99780,\"<>\",Data!$W$3:$W$99780,\"<\"&S51,Data!$W$3:$W$99780,\">=\"&S50,Data!$X$3:$X$99780,1,Data!$AE$3:$AE$99780,TRUE)","v":0},{"$f":"COUNTIFS(Data!$Q$3:$Q$99780,\"<>\",Data!$W$3:$W$99780,\"<\"&T51,Data!$W$3:$W$99780,\">=\"&T50,Data!$X$3:$X$99780,1,Data!$AE$3:$AE$99780,TRUE)","v":0},{"$f":"COUNTIFS(Data!$Q$3:$Q$99780,\"<>\",Data!$W$3:$W$99780,\"<\"&U51,Data!$W$3:$W$99780,\">=\"&U50,Data!$X$3:$X$99780,1,Data!$AE$3:$AE$99780,TRUE)","v":0},{"$f":"COUNTIFS(Data!$Q$3:$Q$99780,\"<>\",Data!$W$3:$W$99780,\"<\"&V51,Data!$W$3:$W$99780,\">=\"&V50,Data!$X$3:$X$99780,1,Data!$AE$3:$AE$99780,TRUE)","v":0},{"$f":"COUNTIFS(Data!$Q$3:$Q$99780,\"<>\",Data!$W$3:$W$99780,\"<\"&W51,Data!$W$3:$W$99780,\">=\"&W50,Data!$X$3:$X$99780,1,Data!$AE$3:$AE$99780,TRUE)","v":0},{"$f":"COUNTIFS(Data!$Q$3:$Q$99780,\"<>\",Data!$W$3:$W$99780,\"<\"&X51,Data!$W$3:$W$99780,\">=\"&X50,Data!$X$3:$X$99780,1,Data!$AE$3:$AE$99780,TRUE)","v":0},{"$f":"COUNTIFS(Data!$Q$3:$Q$99780,\"<>\",Data!$W$3:$W$99780,\"<\"&Y51,Data!$W$3:$W$99780,\">=\"&Y50,Data!$X$3:$X$99780,1,Data!$AE$3:$AE$99780,TRUE)","v":0},{"$f":"COUNTIFS(Data!$Q$3:$Q$99780,\"<>\",Data!$W$3:$W$99780,\"<\"&Z51,Data!$W$3:$W$99780,\">=\"&Z50,Data!$X$3:$X$99780,1,Data!$AE$3:$AE$99780,TRUE)","v":0},{"$f":"COUNTIFS(Data!$Q$3:$Q$99780,\"<>\",Data!$W$3:$W$99780,\"<\"&AA51,Data!$W$3:$W$99780,\">=\"&AA50,Data!$X$3:$X$99780,1,Data!$AE$3:$AE$99780,TRUE)","v":0},{"$f":"COUNTIFS(Data!$Q$3:$Q$99780,\"<>\",Data!$W$3:$W$99780,\"<\"&AB51,Data!$W$3:$W$99780,\">=\"&AB50,Data!$X$3:$X$99780,1,Data!$AE$3:$AE$99780,TRUE)","v":0},{"$f":"COUNTIFS(Data!$Q$3:$Q$99780,\"<>\",Data!$W$3:$W$99780,\"<\"&AC51,Data!$W$3:$W$99780,\">=\"&AC50,Data!$X$3:$X$99780,1,Data!$AE$3:$AE$99780,TRUE)","v":0},{"$f":"COUNTIFS(Data!$Q$3:$Q$99780,\"<>\",Data!$W$3:$W$99780,\"<\"&AD51,Data!$W$3:$W$99780,\">=\"&AD50,Data!$X$3:$X$99780,1,Data!$AE$3:$AE$99780,TRUE)","v":0},{"$f":"COUNTIFS(Data!$Q$3:$Q$99780,\"<>\",Data!$W$3:$W$99780,\"<\"&AE51,Data!$W$3:$W$99780,\">=\"&AE50,Data!$X$3:$X$99780,1,Data!$AE$3:$AE$99780,TRUE)","v":0},{"$f":"COUNTIFS(Data!$Q$3:$Q$99780,\"<>\",Data!$W$3:$W$99780,\"<\"&AF51,Data!$W$3:$W$99780,\">=\"&AF50,Data!$X$3:$X$99780,1,Data!$AE$3:$AE$99780,TRUE)","v":0},{"$f":"COUNTIFS(Data!$Q$3:$Q$99780,\"<>\",Data!$W$3:$W$99780,\"<\"&AG51,Data!$W$3:$W$99780,\">=\"&AG50,Data!$X$3:$X$99780,1,Data!$AE$3:$AE$99780,TRUE)","v":0},{"$f":"COUNTIFS(Data!$Q$3:$Q$99780,\"<>\",Data!$W$3:$W$99780,\"<\"&AH51,Data!$W$3:$W$99780,\">=\"&AH50,Data!$X$3:$X$99780,1,Data!$AE$3:$AE$99780,TRUE)","v":0},{"$f":"COUNTIFS(Data!$Q$3:$Q$99780,\"<>\",Data!$W$3:$W$99780,\"<\"&AI51,Data!$W$3:$W$99780,\">=\"&AI50,Data!$X$3:$X$99780,1,Data!$AE$3:$AE$99780,TRUE)","v":0},{"$f":"COUNTIFS(Data!$Q$3:$Q$99780,\"<>\",Data!$W$3:$W$99780,\"<\"&AJ51,Data!$W$3:$W$99780,\">=\"&AJ50,Data!$X$3:$X$99780,1,Data!$AE$3:$AE$99780,TRUE)","v":0},{"$f":"COUNTIFS(Data!$Q$3:$Q$99780,\"<>\",Data!$W$3:$W$99780,\"<\"&AK51,Data!$W$3:$W$99780,\">=\"&AK50,Data!$X$3:$X$99780,1,Data!$AE$3:$AE$99780,TRUE)","v":0},{"$f":"COUNTIFS(Data!$Q$3:$Q$99780,\"<>\",Data!$W$3:$W$99780,\"<\"&AL51,Data!$W$3:$W$99780,\">=\"&AL50,Data!$X$3:$X$99780,1,Data!$AE$3:$AE$99780,TRUE)","v":0}]
["S2 refusal/withdrawal",{"$f":"COUNTIFS(Data!$P$3:$P$99780,\"<>\",Data!$Q$3:$Q$99780,\"\",Data!$R$3:$R$99780,\"\",Data!$S$3:$S$99780,\"\",Data!$U$3:$U$99780,\"\",Data!$W$3:$W$99780,\"<\"&B51,Data!$W$3:$W$99780,\">=\"&B50,Data!$X$3:$X$99780,\"<>2\",Data!$AE$3:$AE$99780,TRUE)","v":0},{"$f":"COUNTIFS(Data!$P$3:$P$99780,\"<>\",Data!$Q$3:$Q$99780,\"\",Data!$R$3:$R$99780,\"\",Data!$S$3:$S$99780,\"\",Data!$U$3:$U$99780,\"\",Data!$W$3:$W$99780,\"<\"&C51,Data!$W$3:$W$99780,\">=\"&C50,Data!$X$3:$X$99780,\"<>2\",Data!$AE$3:$AE$99780,TRUE)","v":0},{"$f":"COUNTIFS(Data!$P$3:$P$99780,\"<>\",Data!$Q$3:$Q$99780,\"\",Data!$R$3:$R$99780,\"\",Data!$S$3:$S$99780,\"\",Data!$U$3:$U$99780,\"\",Data!$W$3:$W$99780,\"<\"&D51,Data!$W$3:$W$99780,\">=\"&D50,Data!$X$3:$X$99780,\"<>2\",Data!$AE$3:$AE$99780,TRUE)","v":0},{"$f":"COUNTIFS(Data!$P$3:$P$99780,\"<>\",Data!$Q$3:$Q$99780,\"\",Data!$R$3:$R$99780,\"\",Data!$S$3:$S$99780,\"\",Data!$U$3:$U$99780,\"\",Data!$W$3:$W$99780,\"<\"&E51,Data!$W$3:$W$99780,\">=\"&E50,Data!$X$3:$X$99780,\"<>2\",Data!$AE$3:$AE$99780,TRUE)","v":0},{"$f":"COUNTIFS(Data!$P$3:$P$99780,\"<>\",Data!$Q$3:$Q$99780,\"\",Data!$R$3:$R$99780,\"\",Data!$S$3:$S$99780,\"\",Data!$U$3:$U$99780,\"\",Data!$W$3:$W$99780,\"<\"&F51,Data!$W$3:$W$99780,\">=\"&F50,Data!$X$3:$X$99780,\"<>2\",Data!$AE$3:$AE$99780,TRUE)","v":0},{"$f":"COUNTIFS(Data!$P$3:$P$99780,\"<>\",Data!$Q$3:$Q$99780,\"\",Data!$R$3:$R$99780,\"\",Data!$S$3:$S$99780,\"\",Data!$U$3:$U$99780,\"\",Data!$W$3:$W$99780,\"<\"&G51,Data!$W$3:$W$99780,\">=\"&G50,Data!$X$3:$X$99780,\"<>2\",Data!$AE$3:$AE$99780,TRUE)","v":0},{"$f":"COUNTIFS(Data!$P$3:$P$99780,\"<>\",Data!$Q$3:$Q$99780,\"\",Data!$R$3:$R$99780,\"\",Data!$S$3:$S$99780,\"\",Data!$U$3:$U$99780,\"\",Data!$W$3:$W$99780,\"<\"&H51,Data!$W$3:$W$99780,\">=\"&H50,Data!$X$3:$X$99780,\"<>2\",Data!$AE$3:$AE$99780,TRUE)","v":0},{"$f":"COUNTIFS(Data!$P$3:$P$99780,\"<>\",Data!$Q$3:$Q$99780,\"\",Data!$R$3:$R$99780,\"\",Data!$S$3:$S$99780,\"\",Data!$U$3:$U$99780,\"\",Data!$W$3:$W$99780,\"<\"&I51,Data!$W$3:$W$99780,\">=\"&I50,Data!$X$3:$X$99780,\"<>2\",Data!$AE$3:$AE$99780,TRUE)","v":0},{"$f":"COUNTIFS(Data!$P$3:$P$99780,\"<>\",Data!$Q$3:$Q$99780,\"\",Data!$R$3:$R$99780,\"\",Data!$S$3:$S$99780,\"\",Data!$U$3:$U$99780,\"\",Data!$W$3:$W$99780,\"<\"&J51,Data!$W$3:$W$99780,\">=\"&J50,Data!$X$3:$X$99780,\"<>2\",Data!$AE$3:$AE$99780,TRUE)","v":0},{"$f":"COUNTIFS(Data!$P$3:$P$99780,\"<>\",Data!$Q$3:$Q$99780,\"\",Data!$R$3:$R$99780,\"\",Data!$S$3:$S$99780,\"\",Data!$U$3:$U$99780,\"\",Data!$W$3:$W$99780,\"<\"&K51,Data!$W$3:$W$99780,\">=\"&K50,Data!$X$3:$X$99780,\"<>2\",Data!$AE$3:$AE$99780,TRUE)","v":0},{"$f":"COUNTIFS(Data!$P$3:$P$99780,\"<>\",Data!$Q$3:$Q$99780,\"\",Data!$R$3:$R$99780,\"\",Data!$S$3:$S$99780,\"\",Data!$U$3:$U$99780,\"\",Data!$W$3:$W$99780,\"<\"&L51,Data!$W$3:$W$99780,\">=\"&L50,Data!$X$3:$X$99780,\"<>2\",Data!$AE$3:$AE$99780,TRUE)","v":0},{"$f":"COUNTIFS(Data!$P$3:$P$99780,\"<>\",Data!$Q$3:$Q$99780,\"\",Data!$R$3:$R$99780,\"\",Data!$S$3:$S$99780,\"\",Data!$U$3:$U$99780,\"\",Data!$W$3:$W$99780,\"<\"&M51,Data!$W$3:$W$99780,\">=\"&M50,Data!$X$3:$X$99780,\"<>2\",Data!$AE$3:$AE$99780,TRUE)","v":0},{"$f":"COUNTIFS(Data!$P$3:$P$99780,\"<>\",Data!$Q$3:$Q$99780,\"\",Data!$R$3:$R$99780,\"\",Data!$S$3:$S$99780,\"\",Data!$U$3:$U$99780,\"\",Data!$W$3:$W$99780,\"<\"&N51,Data!$W$3:$W$99780,\">=\"&N50,Data!$X$3:$X$99780,\"<>2\",Data!$AE$3:$AE$99780,TRUE)","v":0},{"$f":"COUNTIFS(Data!$P$3:$P$99780,\"<>\",Data!$Q$3:$Q$99780,\"\",Data!$R$3:$R$99780,\"\",Data!$S$3:$S$99780,\"\",Data!$U$3:$U$99780,\"\",Data!$W$3:$W$99780,\"<\"&O51,Data!$W$3:$W$99780,\">=\"&O50,Data!$X$3:$X$99780,\"<>2\",Data!$AE$3:$AE$99780,TRUE)","v":0},{"$f":"COUNTIFS(Data!$P$3:$P$99780,\"<>\",Data!$Q$3:$Q$99780,\"\",Data!$R$3:$R$99780,\"\",Data!$S$3:$S$99780,\"\",Data!$U$3:$U$99780,\"\",Data!$W$3:$W$99780,\"<\"&P51,Data!$W$3:$W$99780,\">=\"&P50,Data!$X$3:$X$99780,\"<>2\",Data!$AE$3:$AE$99780,TRUE)","v":0},{"$f":"COUNTIFS(Data!$P$3:$P$99780,\"<>\",Data!$Q$3:$Q$99780,\"\",Data!$R$3:$R$99780,\"\",Data!$S$3:$S$99780,\"\",Data!$U$3:$U$99780,\"\",Data!$W$3:$W$99780,\"<\"&Q51,Data!$W$3:$W$99780,\">=\"&Q50,Data!$X$3:$X$99780,\"<>2\",Data!$AE$3:$AE$99780,TRUE)","v":0},{"$f":"COUNTIFS(Data!$P$3:$P$99780,\"<>\",Data!$Q$3:$Q$99780,\"\",Data!$R$3:$R$99780,\"\",Data!$S$3:$S$99780,\"\",Data!$U$3:$U$99780,\"\",Data!$W$3:$W$99780,\"<\"&R51,Data!$W$3:$W$99780,\">=\"&R50,Data!$X$3:$X$99780,\"<>2\",Data!$AE$3:$AE$99780,TRUE)","v":0},{"$f":"COUNTIFS(Data!$P$3:$P$99780,\"<>\",Data!$Q$3:$Q$99780,\"\",Data!$R$3:$R$99780,\"\",Data!$S$3:$S$99780,\"\",Data!$U$3:$U$99780,\"\",Data!$W$3:$W$99780,\"<\"&S51,Data!$W$3:$W$99780,\">=\"&S50,Data!$X$3:$X$99780,\"<>2\",Data!$AE$3:$AE$99780,TRUE)","v":0},{"$f":"COUNTIFS(Data!$P$3:$P$99780,\"<>\",Data!$Q$3:$Q$99780,\"\",Data!$R$3:$R$99780,\"\",Data!$S$3:$S$99780,\"\",Data!$U$3:$U$99780,\"\",Data!$W$3:$W$99780,\"<\"&T51,Data!$W$3:$W$99780,\">=\"&T50,Data!$X$3:$X$99780,\"<>2\",Data!$AE$3:$AE$99780,TRUE)","v":0},{"$f":"COUNTIFS(Data!$P$3:$P$99780,\"<>\",Data!$Q$3:$Q$99780,\"\",Data!$R$3:$R$99780,\"\",Data!$S$3:$S$99780,\"\",Data!$U$3:$U$99780,\"\",Data!$W$3:$W$99780,\"<\"&U51,Data!$W$3:$W$99780,\">=\"&U50,Data!$X$3:$X$99780,\"<>2\",Data!$AE$3:$AE$99780,TRUE)","v":0},{"$f":"COUNTIFS(Data!$P$3:$P$99780,\"<>\",Data!$Q$3:$Q$99780,\"\",Data!$R$3:$R$99780,\"\",Data!$S$3:$S$99780,\"\",Data!$U$3:$U$99780,\"\",Data!$W$3:$W$99780,\"<\"&V51,Data!$W$3:$W$99780,\">=\"&V50,Data!$X$3:$X$99780,\"<>2\",Data!$AE$3:$AE$99780,TRUE)","v":0},{"$f":"COUNTIFS(Data!$P$3:$P$99780,\"<>\",Data!$Q$3:$Q$99780,\"\",Data!$R$3:$R$99780,\"\",Data!$S$3:$S$99780,\"\",Data!$U$3:$U$99780,\"\",Data!$W$3:$W$99780,\"<\"&W51,Data!$W$3:$W$99780,\">=\"&W50,Data!$X$3:$X$99780,\"<>2\",Data!$AE$3:$AE$99780,TRUE)","v":0},{"$f":"COUNTIFS(Data!$P$3:$P$99780,\"<>\",Data!$Q$3:$Q$99780,\"\",Data!$R$3:$R$99780,\"\",Data!$S$3:$S$99780,\"\",Data!$U$3:$U$99780,\"\",Data!$W$3:$W$99780,\"<\"&X51,Data!$W$3:$W$99780,\">=\"&X50,Data!$X$3:$X$99780,\"<>2\",Data!$AE$3:$AE$99780,TRUE)","v":0},{"$f":"COUNTIFS(Data!$P$3:$P$99780,\"<>\",Data!$Q$3:$Q$99780,\"\",Data!$R$3:$R$99780,\"\",Data!$S$3:$S$99780,\"\",Data!$U$3:$U$99780,\"\",Data!$W$3:$W$99780,\"<\"&Y51,Data!$W$3:$W$99780,\">=\"&Y50,Data!$X$3:$X$99780,\"<>2\",Data!$AE$3:$AE$99780,TRUE)","v":0},{"$f":"COUNTIFS(Data!$P$3:$P$99780,\"<>\",Data!$Q$3:$Q$99780,\"\",Data!$R$3:$R$99780,\"\",Data!$S$3:$S$99780,\"\",Data!$U$3:$U$99780,\"\",Data!$W$3:$W$99780,\"<\"&Z51,Data!$W$3:$W$99780,\">=\"&Z50,Data!$X$3:$X$99780,\"<>2\",Data!$AE$3:$AE$99780,TRUE)","v":0},{"$f":"COUNTIFS(Data!$P$3:$P$99780,\"<>\",Data!$Q$3:$Q$99780,\"\",Data!$R$3:$R$99780,\"\",Data!$S$3:$S$99780,\"\",Data!$U$3:$U$99780,\"\",Data!$W$3:$W$99780,\"<\"&AA51,Data!$W$3:$W$99780,\">=\"&AA50,Data!$X$3:$X$99780,\"<>2\",Data!$AE$3:$AE$99780,TRUE)","v":0},{"$f":"COUNTIFS(Data!$P$3:$P$99780,\"<>\",Data!$Q$3:$Q$99780,\"\",Data!$R$3:$R$99780,\"\",Data!$S$3:$S$99780,\"\",Data!$U$3:$U$99780,\"\",Data!$W$3:$W$99780,\"<\"&AB51,Data!$W$3:$W$99780,\">=\"&AB50,Data!$X$3:$X$99780,\"<>2\",Data!$AE$3:$AE$99780,TRUE)","v":0},{"$f":"COUNTIFS(Data!$P$3:$P$99780,\"<>\",Data!$Q$3:$Q$99780,\"\",Data!$R$3:$R$99780,\"\",Data!$S$3:$S$99780,\"\",Data!$U$3:$U$99780,\"\",Data!$W$3:$W$99780,\"<\"&AC51,Data!$W$3:$W$99780,\">=\"&AC50,Data!$X$3:$X$99780,\"<>2\",Data!$AE$3:$AE$99780,TRUE)","v":0},{"$f":"COUNTIFS(Data!$P$3:$P$99780,\"<>\",Data!$Q$3:$Q$99780,\"\",Data!$R$3:$R$99780,\"\",Data!$S$3:$S$99780,\"\",Data!$U$3:$U$99780,\"\",Data!$W$3:$W$99780,\"<\"&AD51,Data!$W$3:$W$99780,\">=\"&AD50,Data!$X$3:$X$99780,\"<>2\",Data!$AE$3:$AE$99780,TRUE)","v":0},{"$f":"COUNTIFS(Data!$P$3:$P$99780,\"<>\",Data!$Q$3:$Q$99780,\"\",Data!$R$3:$R$99780,\"\",Data!$S$3:$S$99780,\"\",Data!$U$3:$U$99780,\"\",Data!$W$3:$W$99780,\"<\"&AE51,Data!$W$3:$W$99780,\">=\"&AE50,Data!$X$3:$X$99780,\"<>2\",Data!$AE$3:$AE$99780,TRUE)","v":0},{"$f":"COUNTIFS(Data!$P$3:$P$99780,\"<>\",Data!$Q$3:$Q$99780,\"\",Data!$R$3:$R$99780,\"\",Data!$S$3:$S$99780,\"\",Data!$U$3:$U$99780,\"\",Data!$W$3:$W$99780,\"<\"&AF51,Data!$W$3:$W$99780,\">=\"&AF50,Data!$X$3:$X$99780,\"<>2\",Data!$AE$3:$AE$99780,TRUE)","v":0},{"$f":"COUNTIFS(Data!$P$3:$P$99780,\"<>\",Data!$Q$3:$Q$99780,\"\",Data!$R$3:$R$99780,\"\",Data!$S$3:$S$99780,\"\",Data!$U$3:$U$99780,\"\",Data!$W$3:$W$99780,\"<\"&AG51,Data!$W$3:$W$99780,\">=\"&AG50,Data!$X$3:$X$99780,\"<>2\",Data!$AE$3:$AE$99780,TRUE)","v":0},{"$f":"COUNTIFS(Data!$P$3:$P$99780,\"<>\",Data!$Q$3:$Q$99780,\"\",Data!$R$3:$R$99780,\"\",Data!$S$3:$S$99780,\"\",Data!$U$3:$U$99780,\"\",Data!$W$3:$W$99780,\"<\"&AH51,Data!$W$3:$W$99780,\">=\"&AH50,Data!$X$3:$X$99780,\"<>2\",Data!$AE$3:$AE$99780,TRUE)","v":0},{"$f":"COUNTIFS(Data!$P$3:$P$99780,\"<>\",Data!$Q$3:$Q$99780,\"\",Data!$R$3:$R$99780,\"\",Data!$S$3:$S$99780,\"\",Data!$U$3:$U$99780,\"\",Data!$W$3:$W$99780,\"<\"&AI51,Data!$W$3:$W$99780,\">=\"&AI50,Data!$X$3:$X$99780,\"<>2\",Data!$AE$3:$AE$99780,TRUE)","v":0},{"$f":"COUNTIFS(Data!$P$3:$P$99780,\"<>\",Data!$Q$3:$Q$99780,\"\",Data!$R$3:$R$99780,\"\",Data!$S$3:$S$99780,\"\",Data!$U$3:$U$99780,\"\",Data!$W$3:$W$99780,\"<\"&AJ51,Data!$W$3:$W$99780,\">=\"&AJ50,Data!$X$3:$X$99780,\"<>2\",Data!$AE$3:$AE$99780,TRUE)","v":0},{"$f":"COUNTIFS(Data!$P$3:$P$99780,\"<>\",Data!$Q$3:$Q$99780,\"\",Data!$R$3:$R$99780,\"\",Data!$S$3:$S$99780,\"\",Data!$U$3:$U$99780,\"\",Data!$W$3:$W$99780,\"<\"&AK51,Data!$W$3:$W$99780,\">=\"&AK50,Data!$X$3:$X$99780,\"<>2\",Data!$AE$3:$AE$99780,TRUE)","v":0},{"$f":"COUNTIFS(Data!$P$3:$P$99780,\"<>\",Data!$Q$3:$Q$99780,\"\",Data!$R$3:$R$99780,\"\",Data!$S$3:$S$99780,\"\",Data!$U$3:$U$99780,\"\",Data!$W$3:$W$99780,\"<\"&AL51,Data!$W$3:$W$99780,\">=\"&AL50,Data!$X$3:$X$99780,\"<>2\",Data!$AE$3:$AE$99780,TRUE)","v":0}]
["S1 refusal/withdrawal",{"$f":"COUNTIFS(Data!$N$3:$N$99780,\"<>\",Data!$O$3:$O$99780,\"\",Data!$P$3:$P$99780,\"\",Data!$Q$3:$Q$99780,\"\",Data!$R$3:$R$99780,\"\",Data!$S$3:$S$99780,\"\",Data!$U$3:$U$99780,\"\",Data!$W$3:$W$99780,\"<\"&B51,Data!$W$3:$W$99780,\">=\"&B50,Data!$X$3:$X$99780,\"<>2\",Data!$AE$3:$AE$99780,TRUE)","v":0},{"$f":"COUNTIFS(Data!$N$3:$N$99780,\"<>\",Data!$O$3:$O$99780,\"\",Data!$P$3:$P$99780,\"\",Data!$Q$3:$Q$99780,\"\",Data!$R$3:$R$99780,\"\",Data!$S$3:$S$99780,\"\",Data!$U$3:$U$99780,\"\",Data!$W$3:$W$99780,\"<\"&C51,Data!$W$3:$W$99780,\">=\"&C50,Data!$X$3:$X$99780,\"<>2\",Data!$AE$3:$AE$99780,TRUE)","v":0},{"$f":"COUNTIFS(Data!$N$3:$N$99780,\"<>\",Data!$O$3:$O$99780,\"\",Data!$P$3:$P$99780,\"\",Data!$Q$3:$Q$99780,\"\",Data!$R$3:$R$99780,\"\",Data!$S$3:$S$99780,\"\",Data!$U$3:$U$99780,\"\",Data!$W$3:$W$99780,\"<\"&D51,Data!$W$3:$W$99780,\">=\"&D50,Data!$X$3:$X$99780,\"<>2\",Data!$AE$3:$AE$99780,TRUE)","v":0},{"$f":"COUNTIFS(Data!$N$3:$N$99780,\"<>\",Data!$O$3:$O$99780,\"\",Data!$P$3:$P$99780,\"\",Data!$Q$3:$Q$99780,\"\",Data!$R$3:$R$99780,\"\",Data!$S$3:$S$99780,\"\",Data!$U$3:$U$99780,\"\",Data!$W$3:$W$99780,\"<\"&E51,Data!$W$3:$W$99780,\">=\"&E50,Data!$X$3:$X$99780,\"<>2\",Data!$AE$3:$AE$99780,TRUE)","v":0},{"$f":"COUNTIFS(Data!$N$3:$N$99780,\"<>\",Data!$O$3:$O$99780,\"\",Data!$P$3:$P$99780,\"\",Data!$Q$3:$Q$99780,\"\",Data!$R$3:$R$99780,\"\",Data!$S$3:$S$99780,\"\",Data!$U$3:$U$99780,\"\",Data!$W$3:$W$99780,\"<\"&F51,Data!$W$3:$W$99780,\">=\"&F50,Data!$X$3:$X$99780,\"<>2\",Data!$AE$3:$AE$99780,TRUE)","v":0},{"$f":"COUNTIFS(Data!$N$3:$N$99780,\"<>\",Data!$O$3:$O$99780,\"\",Data!$P$3:$P$99780,\"\",Data!$Q$3:$Q$99780,\"\",Data!$R$3:$R$99780,\"\",Data!$S$3:$S$99780,\"\",Data!$U$3:$U$99780,\"\",Data!$W$3:$W$99780,\"<\"&G51,Data!$W$3:$W$99780,\">=\"&G50,Data!$X$3:$X$99780,\"<>2\",Data!$AE$3:$AE$99780,TRUE)","v":0},{"$f":"COUNTIFS(Data!$N$3:$N$99780,\"<>\",Data!$O$3:$O$99780,\"\",Data!$P$3:$P$99780,\"\",Data!$Q$3:$Q$99780,\"\",Data!$R$3:$R$99780,\"\",Data!$S$3:$S$99780,\"\",Data!$U$3:$U$99780,\"\",Data!$W$3:$W$99780,\"<\"&H51,Data!$W$3:$W$99780,\">=\"&H50,Data!$X$3:$X$99780,\"<>2\",Data!$AE$3:$AE$99780,TRUE)","v":0},{"$f":"COUNTIFS(Data!$N$3:$N$99780,\"<>\",Data!$O$3:$O$99780,\"\",Data!$P$3:$P$99780,\"\",Data!$Q$3:$Q$99780,\"\",Data!$R$3:$R$99780,\"\",Data!$S$3:$S$99780,\"\",Data!$U$3:$U$99780,\"\",Data!$W$3:$W$99780,\"<\"&I51,Data!$W$3:$W$99780,\">=\"&I50,Data!$X$3:$X$99780,\"<>2\",Data!$AE$3:$AE$99780,TRUE)","v":0},{"$f":"COUNTIFS(Data!$N$3:$N$99780,\"<>\",Data!$O$3:$O$99780,\"\",Data!$P$3:$P$99780,\"\",Data!$Q$3:$Q$99780,\"\",Data!$R$3:$R$99780,\"\",Data!$S$3:$S$99780,\"\",Data!$U$3:$U$99780,\"\",Data!$W$3:$W$99780,\"<\"&J51,Data!$W$3:$W$99780,\">=\"&J50,Data!$X$3:$X$99780,\"<>2\",Data!$AE$3:$AE$99780,TRUE)","v":0},{"$f":"COUNTIFS(Data!$N$3:$N$99780,\"<>\",Data!$O$3:$O$99780,\"\",Data!$P$3:$P$99780,\"\",Data!$Q$3:$Q$99780,\"\",Data!$R$3:$R$99780,\"\",Data!$S$3:$S$99780,\"\",Data!$U$3:$U$99780,\"\",Data!$W$3:$W$99780,\"<\"&K51,Data!$W$3:$W$99780,\">=\"&K50,Data!$X$3:$X$99780,\"<>2\",Data!$AE$3:$AE$99780,TRUE)","v":0},{"$f":"COUNTIFS(Data!$N$3:$N$99780,\"<>\",Data!$O$3:$O$99780,\"\",Data!$P$3:$P$99780,\"\",Data!$Q$3:$Q$99780,\"\",Data!$R$3:$R$99780,\"\",Data!$S$3:$S$99780,\"\",Data!$U$3:$U$99780,\"\",Data!$W$3:$W$99780,\"<\"&L51,Data!$W$3:$W$99780,\">=\"&L50,Data!$X$3:$X$99780,\"<>2\",Data!$AE$3:$AE$99780,TRUE)","v":0},{"$f":"COUNTIFS(Data!$N$3:$N$99780,\"<>\",Data!$O$3:$O$99780,\"\",Data!$P$3:$P$99780,\"\",Data!$Q$3:$Q$99780,\"\",Data!$R$3:$R$99780,\"\",Data!$S$3:$S$99780,\"\",Data!$U$3:$U$99780,\"\",Data!$W$3:$W$99780,\"<\"&M51,Data!$W$3:$W$99780,\">=\"&M50,Data!$X$3:$X$99780,\"<>2\",Data!$AE$3:$AE$99780,TRUE)","v":0},{"$f":"COUNTIFS(Data!$N$3:$N$99780,\"<>\",Data!$O$3:$O$99780,\"\",Data!$P$3:$P$99780,\"\",Data!$Q$3:$Q$99780,\"\",Data!$R$3:$R$99780,\"\",Data!$S$3:$S$99780,\"\",Data!$U$3:$U$99780,\"\",Data!$W$3:$W$99780,\"<\"&N51,Data!$W$3:$W$99780,\">=\"&N50,Data!$X$3:$X$99780,\"<>2\",Data!$AE$3:$AE$99780,TRUE)","v":0},{"$f":"COUNTIFS(Data!$N$3:$N$99780,\"<>\",Data!$O$3:$O$99780,\"\",Data!$P$3:$P$99780,\"\",Data!$Q$3:$Q$99780,\"\",Data!$R$3:$R$99780,\"\",Data!$S$3:$S$99780,\"\",Data!$U$3:$U$99780,\"\",Data!$W$3:$W$99780,\"<\"&O51,Data!$W$3:$W$99780,\">=\"&O50,Data!$X$3:$X$99780,\"<>2\",Data!$AE$3:$AE$99780,TRUE)","v":0},{"$f":"COUNTIFS(Data!$N$3:$N$99780,\"<>\",Data!$O$3:$O$99780,\"\",Data!$P$3:$P$99780,\"\",Data!$Q$3:$Q$99780,\"\",Data!$R$3:$R$99780,\"\",Data!$S$3:$S$99780,\"\",Data!$U$3:$U$99780,\"\",Data!$W$3:$W$99780,\"<\"&P51,Data!$W$3:$W$99780,\">=\"&P50,Data!$X$3:$X$99780,\"<>2\",Data!$AE$3:$AE$99780,TRUE)","v":0},{"$f":"COUNTIFS(Data!$N$3:$N$99780,\"<>\",Data!$O$3:$O$99780,\"\",Data!$P$3:$P$99780,\"\",Data!$Q$3:$Q$99780,\"\",Data!$R$3:$R$99780,\"\",Data!$S$3:$S$99780,\"\",Data!$U$3:$U$99780,\"\",Data!$W$3:$W$99780,\"<\"&Q51,Data!$W$3:$W$99780,\">=\"&Q50,Data!$X$3:$X$99780,\"<>2\",Data!$AE$3:$AE$99780,TRUE)","v":0},{"$f":"COUNTIFS(Data!$N$3:$N$99780,\"<>\",Data!$O$3:$O$99780,\"\",Data!$P$3:$P$99780,\"\",Data!$Q$3:$Q$99780,\"\",Data!$R$3:$R$99780,\"\",Data!$S$3:$S$99780,\"\",Data!$U$3:$U$99780,\"\",Data!$W$3:$W$99780,\"<\"&R51,Data!$W$3:$W$99780,\">=\"&R50,Data!$X$3:$X$99780,\"<>2\",Data!$AE$3:$AE$99780,TRUE)","v":0},{"$f":"COUNTIFS(Data!$N$3:$N$99780,\"<>\",Data!$O$3:$O$99780,\"\",Data!$P$3:$P$99780,\"\",Data!$Q$3:$Q$99780,\"\",Data!$R$3:$R$99780,\"\",Data!$S$3:$S$99780,\"\",Data!$U$3:$U$99780,\"\",Data!$W$3:$W$99780,\"<\"&S51,Data!$W$3:$W$99780,\">=\"&S50,Data!$X$3:$X$99780,\"<>2\",Data!$AE$3:$AE$99780,TRUE)","v":0},{"$f":"COUNTIFS(Data!$N$3:$N$99780,\"<>\",Data!$O$3:$O$99780,\"\",Data!$P$3:$P$99780,\"\",Data!$Q$3:$Q$99780,\"\",Data!$R$3:$R$99780,\"\",Data!$S$3:$S$99780,\"\",Data!$U$3:$U$99780,\"\",Data!$W$3:$W$99780,\"<\"&T51,Data!$W$3:$W$99780,\">=\"&T50,Data!$X$3:$X$99780,\"<>2\",Data!$AE$3:$AE$99780,TRUE)","v":0},{"$f":"COUNTIFS(Data!$N$3:$N$99780,\"<>\",Data!$O$3:$O$99780,\"\",Data!$P$3:$P$99780,\"\",Data!$Q$3:$Q$99780,\"\",Data!$R$3:$R$99780,\"\",Data!$S$3:$S$99780,\"\",Data!$U$3:$U$99780,\"\",Data!$W$3:$W$99780,\"<\"&U51,Data!$W$3:$W$99780,\">=\"&U50,Data!$X$3:$X$99780,\"<>2\",Data!$AE$3:$AE$99780,TRUE)","v":0},{"$f":"COUNTIFS(Data!$N$3:$N$99780,\"<>\",Data!$O$3:$O$99780,\"\",Data!$P$3:$P$99780,\"\",Data!$Q$3:$Q$99780,\"\",Data!$R$3:$R$99780,\"\",Data!$S$3:$S$99780,\"\",Data!$U$3:$U$99780,\"\",Data!$W$3:$W$99780,\"<\"&V51,Data!$W$3:$W$99780,\">=\"&V50,Data!$X$3:$X$99780,\"<>2\",Data!$AE$3:$AE$99780,TRUE)","v":0},{"$f":"COUNTIFS(Data!$N$3:$N$99780,\"<>\",Data!$O$3:$O$99780,\"\",Data!$P$3:$P$99780,\"\",Data!$Q$3:$Q$99780,\"\",Data!$R$3:$R$99780,\"\",Data!$S$3:$S$99780,\"\",Data!$U$3:$U$99780,\"\",Data!$W$3:$W$99780,\"<\"&W51,Data!$W$3:$W$99780,\">=\"&W50,Data!$X$3:$X$99780,\"<>2\",Data!$AE$3:$AE$99780,TRUE)","v":0},{"$f":"COUNTIFS(Data!$N$3:$N$99780,\"<>\",Data!$O$3:$O$99780,\"\",Data!$P$3:$P$99780,\"\",Data!$Q$3:$Q$99780,\"\",Data!$R$3:$R$99780,\"\",Data!$S$3:$S$99780,\"\",Data!$U$3:$U$99780,\"\",Data!$W$3:$W$99780,\"<\"&X51,Data!$W$3:$W$99780,\">=\"&X50,Data!$X$3:$X$99780,\"<>2\",Data!$AE$3:$AE$99780,TRUE)","v":0},{"$f":"COUNTIFS(Data!$N$3:$N$99780,\"<>\",Data!$O$3:$O$99780,\"\",Data!$P$3:$P$99780,\"\",Data!$Q$3:$Q$99780,\"\",Data!$R$3:$R$99780,\"\",Data!$S$3:$S$99780,\"\",Data!$U$3:$U$99780,\"\",Data!$W$3:$W$99780,\"<\"&Y51,Data!$W$3:$W$99780,\">=\"&Y50,Data!$X$3:$X$99780,\"<>2\",Data!$AE$3:$AE$99780,TRUE)","v":0},{"$f":"COUNTIFS(Data!$N$3:$N$99780,\"<>\",Data!$O$3:$O$99780,\"\",Data!$P$3:$P$99780,\"\",Data!$Q$3:$Q$99780,\"\",Data!$R$3:$R$99780,\"\",Data!$S$3:$S$99780,\"\",Data!$U$3:$U$99780,\"\",Data!$W$3:$W$99780,\"<\"&Z51,Data!$W$3:$W$99780,\">=\"&Z50,Data!$X$3:$X$99780,\"<>2\",Data!$AE$3:$AE$99780,TRUE)","v":0},{"$f":"COUNTIFS(Data!$N$3:$N$99780,\"<>\",Data!$O$3:$O$99780,\"\",Data!$P$3:$P$99780,\"\",Data!$Q$3:$Q$99780,\"\",Data!$R$3:$R$99780,\"\",Data!$S$3:$S$99780,\"\",Data!$U$3:$U$99780,\"\",Data!$W$3:$W$99780,\"<\"&AA51,Data!$W$3:$W$99780,\">=\"&AA50,Data!$X$3:$X$99780,\"<>2\",Data!$AE$3:$AE$99780,TRUE)","v":0},{"$f":"COUNTIFS(Data!$N$3:$N$99780,\"<>\",Data!$O$3:$O$99780,\"\",Data!$P$3:$P$99780,\"\",Data!$Q$3:$Q$99780,\"\",Data!$R$3:$R$99780,\"\",Data!$S$3:$S$99780,\"\",Data!$U$3:$U$99780,\"\",Data!$W$3:$W$99780,\"<\"&AB51,Data!$W$3:$W$99780,\">=\"&AB50,Data!$X$3:$X$99780,\"<>2\",Data!$AE$3:$AE$99780,TRUE)","v":0},{"$f":"COUNTIFS(Data!$N$3:$N$99780,\"<>\",Data!$O$3:$O$99780,\"\",Data!$P$3:$P$99780,\"\",Data!$Q$3:$Q$99780,\"\",Data!$R$3:$R$99780,\"\",Data!$S$3:$S$99780,\"\",Data!$U$3:$U$99780,\"\",Data!$W$3:$W$99780,\"<\"&AC51,Data!$W$3:$W$99780,\">=\"&AC50,Data!$X$3:$X$99780,\"<>2\",Data!$AE$3:$AE$99780,TRUE)","v":0},{"$f":"COUNTIFS(Data!$N$3:$N$99780,\"<>\",Data!$O$3:$O$99780,\"\",Data!$P$3:$P$99780,\"\",Data!$Q$3:$Q$99780,\"\",Data!$R$3:$R$99780,\"\",Data!$S$3:$S$99780,\"\",Data!$U$3:$U$99780,\"\",Data!$W$3:$W$99780,\"<\"&AD51,Data!$W$3:$W$99780,\">=\"&AD50,Data!$X$3:$X$99780,\"<>2\",Data!$AE$3:$AE$99780,TRUE)","v":0},{"$f":"COUNTIFS(Data!$N$3:$N$99780,\"<>\",Data!$O$3:$O$99780,\"\",Data!$P$3:$P$99780,\"\",Data!$Q$3:$Q$99780,\"\",Data!$R$3:$R$99780,\"\",Data!$S$3:$S$99780,\"\",Data!$U$3:$U$99780,\"\",Data!$W$3:$W$99780,\"<\"&AE51,Data!$W$3:$W$99780,\">=\"&AE50,Data!$X$3:$X$99780,\"<>2\",Data!$AE$3:$AE$99780,TRUE)","v":0},{"$f":"COUNTIFS(Data!$N$3:$N$99780,\"<>\",Data!$O$3:$O$99780,\"\",Data!$P$3:$P$99780,\"\",Data!$Q$3:$Q$99780,\"\",Data!$R$3:$R$99780,\"\",Data!$S$3:$S$99780,\"\",Data!$U$3:$U$99780,\"\",Data!$W$3:$W$99780,\"<\"&AF51,Data!$W$3:$W$99780,\">=\"&AF50,Data!$X$3:$X$99780,\"<>2\",Data!$AE$3:$AE$99780,TRUE)","v":0},{"$f":"COUNTIFS(Data!$N$3:$N$99780,\"<>\",Data!$O$3:$O$99780,\"\",Data!$P$3:$P$99780,\"\",Data!$Q$3:$Q$99780,\"\",Data!$R$3:$R$99780,\"\",Data!$S$3:$S$99780,\"\",Data!$U$3:$U$99780,\"\",Data!$W$3:$W$99780,\"<\"&AG51,Data!$W$3:$W$99780,\">=\"&AG50,Data!$X$3:$X$99780,\"<>2\",Data!$AE$3:$AE$99780,TRUE)","v":0},{"$f":"COUNTIFS(Data!$N$3:$N$99780,\"<>\",Data!$O$3:$O$99780,\"\",Data!$P$3:$P$99780,\"\",Data!$Q$3:$Q$99780,\"\",Data!$R$3:$R$99780,\"\",Data!$S$3:$S$99780,\"\",Data!$U$3:$U$99780,\"\",Data!$W$3:$W$99780,\"<\"&AH51,Data!$W$3:$W$99780,\">=\"&AH50,Data!$X$3:$X$99780,\"<>2\",Data!$AE$3:$AE$99780,TRUE)","v":0},{"$f":"COUNTIFS(Data!$N$3:$N$99780,\"<>\",Data!$O$3:$O$99780,\"\",Data!$P$3:$P$99780,\"\",Data!$Q$3:$Q$99780,\"\",Data!$R$3:$R$99780,\"\",Data!$S$3:$S$99780,\"\",Data!$U$3:$U$99780,\"\",Data!$W$3:$W$99780,\"<\"&AI51,Data!$W$3:$W$99780,\">=\"&AI50,Data!$X$3:$X$99780,\"<>2\",Data!$AE$3:$AE$99780,TRUE)","v":0},{"$f":"COUNTIFS(Data!$N$3:$N$99780,\"<>\",Data!$O$3:$O$99780,\"\",Data!$P$3:$P$99780,\"\",Data!$Q$3:$Q$99780,\"\",Data!$R$3:$R$99780,\"\",Data!$S$3:$S$99780,\"\",Data!$U$3:$U$99780,\"\",Data!$W$3:$W$99780,\"<\"&AJ51,Data!$W$3:$W$99780,\">=\"&AJ50,Data!$X$3:$X$99780,\"<>2\",Data!$AE$3:$AE$99780,TRUE)","v":0},{"$f":"COUNTIFS(Data!$N$3:$N$99780,\"<>\",Data!$O$3:$O$99780,\"\",Data!$P$3:$P$99780,\"\",Data!$Q$3:$Q$99780,\"\",Data!$R$3:$R$99780,\"\",Data!$S$3:$S$99780,\"\",Data!$U$3:$U$99780,\"\",Data!$W$3:$W$99780,\"<\"&AK51,Data!$W$3:$W$99780,\">=\"&AK50,Data!$X$3:$X$99780,\"<>2\",Data!$AE$3:$AE$99780,TRUE)","v":0},{"$f":"COUNTIFS(Data!$N$3:$N$99780,\"<>\",Data!$O$3:$O$99780,\"\",Data!$P$3:$P$99780,\"\",Data!$Q$3:$Q$99780,\"\",Data!$R$3:$R$99780,\"\",Data!$S$3:$S$99780,\"\",Data!$U$3:$U$99780,\"\",Data!$W$3:$W$99780,\"<\"&AL51,Data!$W$3:$W$99780,\">=\"&AL50,Data!$X$3:$X$99780,\"<>2\",Data!$AE$3:$AE$99780,TRUE)","v":0}]
["S2 within 4 months",{"$f":"IF(B55>0,COUNTIFS(Data!$Q$3:$Q$99780,\">=\"&B50,Data!$Q$3:$Q$99780,\"<\"&B51,Data!$DY$3:$DY$99780,\"<4\",Data!$AE$3:$AE$99780,TRUE)/B55,\"\")","v":""},{"$f":"IF(C55>0,COUNTIFS(Data!$Q$3:$Q$99780,\">=\"&C50,Data!$Q$3:$Q$99780,\"<\"&C51,Data!$DY$3:$DY$99780,\"<4\",Data!$AE$3:$AE$99780,TRUE)/C55,\"\")","v":""},{"$f":"IF(D55>0,COUNTIFS(Data!$Q$3:$Q$99780,\">=\"&D50,Data!$Q$3:$Q$99780,\"<\"&D51,Data!$DY$3:$DY$99780,\"<4\",Data!$AE$3:$AE$99780,TRUE)/D55,\"\")","v":""},{"$f":"IF(E55>0,COUNTIFS(Data!$Q$3:$Q$99780,\">=\"&E50,Data!$Q$3:$Q$99780,\"<\"&E51,Data!$DY$3:$DY$99780,\"<4\",Data!$AE$3:$AE$99780,TRUE)/E55,\"\")","v":""},{"$f":"IF(F55>0,COUNTIFS(Data!$Q$3:$Q$99780,\">=\"&F50,Data!$Q$3:$Q$99780,\"<\"&F51,Data!$DY$3:$DY$99780,\"<4\",Data!$AE$3:$AE$99780,TRUE)/F55,\"\")","v":""},{"$f":"IF(G55>0,COUNTIFS(Data!$Q$3:$Q$99780,\">=\"&G50,Data!$Q$3:$Q$99780,\"<\"&G51,Data!$DY$3:$DY$99780,\"<4\",Data!$AE$3:$AE$99780,TRUE)/G55,\"\")","v":""},{"$f":"IF(H55>0,COUNTIFS(Data!$Q$3:$Q$99780,\">=\"&H50,Data!$Q$3:$Q$99780,\"<\"&H51,Data!$DY$3:$DY$99780,\"<4\",Data!$AE$3:$AE$99780,TRUE)/H55,\"\")","v":""},{"$f":"IF(I55>0,COUNTIFS(Data!$Q$3:$Q$99780,\">=\"&I50,Data!$Q$3:$Q$99780,\"<\"&I51,Data!$DY$3:$DY$99780,\"<4\",Data!$AE$3:$AE$99780,TRUE)/I55,\"\")","v":""},{"$f":"IF(J55>0,COUNTIFS(Data!$Q$3:$Q$99780,\">=\"&J50,Data!$Q$3:$Q$99780,\"<\"&J51,Data!$DY$3:$DY$99780,\"<4\",Data!$AE$3:$AE$99780,TRUE)/J55,\"\")","v":""},{"$f":"IF(K55>0,COUNTIFS(Data!$Q$3:$Q$99780,\">=\"&K50,Data!$Q$3:$Q$99780,\"<\"&K51,Data!$DY$3:$DY$99780,\"<4\",Data!$AE$3:$AE$99780,TRUE)/K55,\"\")","v":""},{"$f":"IF(L55>0,COUNTIFS(Data!$Q$3:$Q$99780,\">=\"&L50,Data!$Q$3:$Q$99780,\"<\"&L51,Data!$DY$3:$DY$99780,\"<4\",Data!$AE$3:$AE$99780,TRUE)/L55,\"\")","v":""},{"$f":"IF(M55>0,COUNTIFS(Data!$Q$3:$Q$99780,\">=\"&M50,Data!$Q$3:$Q$99780,\"<\"&M51,Data!$DY$3:$DY$99780,\"<4\",Data!$AE$3:$AE$99780,TRUE)/M55,\"\")","v":""},{"$f":"IF(N55>0,COUNTIFS(Data!$Q$3:$Q$99780,\">=\"&N50,Data!$Q$3:$Q$99780,\"<\"&N51,Data!$DY$3:$DY$99780,\"<4\",Data!$AE$3:$AE$99780,TRUE)/N55,\"\")","v":""},{"$f":"IF(O55>0,COUNTIFS(Data!$Q$3:$Q$99780,\">=\"&O50,Data!$Q$3:$Q$99780,\"<\"&O51,Data!$DY$3:$DY$99780,\"<4\",Data!$AE$3:$AE$99780,TRUE)/O55,\"\")","v":""},{"$f":"IF(P55>0,COUNTIFS(Data!$Q$3:$Q$99780,\">=\"&P50,Data!$Q$3:$Q$99780,\"<\"&P51,Data!$DY$3:$DY$99780,\"<4\",Data!$AE$3:$AE$99780,TRUE)/P55,\"\")","v":""},{"$f":"IF(Q55>0,COUNTIFS(Data!$Q$3:$Q$99780,\">=\"&Q50,Data!$Q$3:$Q$99780,\"<\"&Q51,Data!$DY$3:$DY$99780,\"<4\",Data!$AE$3:$AE$99780,TRUE)/Q55,\"\")","v":""},{"$f":"IF(R55>0,COUNTIFS(Data!$Q$3:$Q$99780,\">=\"&R50,Data!$Q$3:$Q$99780,\"<\"&R51,Data!$DY$3:$DY$99780,\"<4\",Data!$AE$3:$AE$99780,TRUE)/R55,\"\")","v":""},{"$f":"IF(S55>0,COUNTIFS(Data!$Q$3:$Q$99780,\">=\"&S50,Data!$Q$3:$Q$99780,\"<\"&S51,Data!$DY$3:$DY$99780,\"<4\",Data!$AE$3:$AE$99780,TRUE)/S55,\"\")","v":""},{"$f":"IF(T55>0,COUNTIFS(Data!$Q$3:$Q$99780,\">=\"&T50,Data!$Q$3:$Q$99780,\"<\"&T51,Data!$DY$3:$DY$99780,\"<4\",Data!$AE$3:$AE$99780,TRUE)/T55,\"\")","v":""},{"$f":"IF(U55>0,COUNTIFS(Data!$Q$3:$Q$99780,\">=\"&U50,Data!$Q$3:$Q$99780,\"<\"&U51,Data!$DY$3:$DY$99780,\"<4\",Data!$AE$3:$AE$99780,TRUE)/U55,\"\")","v":""},{"$f":"IF(V55>0,COUNTIFS(Data!$Q$3:$Q$99780,\">=\"&V50,Data!$Q$3:$Q$99780,\"<\"&V51,Data!$DY$3:$DY$99780,\"<4\",Data!$AE$3:$AE$99780,TRUE)/V55,\"\")","v":""},{"$f":"IF(W55>0,COUNTIFS(Data!$Q$3:$Q$99780,\">=\"&W50,Data!$Q$3:$Q$99780,\"<\"&W51,Data!$DY$3:$DY$99780,\"<4\",Data!$AE$3:$AE$99780,TRUE)/W55,\"\")","v":""},{"$f":"IF(X55>0,COUNTIFS(Data!$Q$3:$Q$99780,\">=\"&X50,Data!$Q$3:$Q$99780,\"<\"&X51,Data!$DY$3:$DY$99780,\"<4\",Data!$AE$3:$AE$99780,TRUE)/X55,\"\")","v":""},{"$f":"IF(Y55>0,COUNTIFS(Data!$Q$3:$Q$99780,\">=\"&Y50,Data!$Q$3:$Q$99780,\"<\"&Y51,Data!$DY$3:$DY$99780,\"<4\",Data!$AE$3:$AE$99780,TRUE)/Y55,\"\")","v":""},{"$f":"IF(Z55>0,COUNTIFS(Data!$Q$3:$Q$99780,\">=\"&Z50,Data!$Q$3:$Q$99780,\"<\"&Z51,Data!$DY$3:$DY$99780,\"<4\",Data!$AE$3:$AE$99780,TRUE)/Z55,\"\")","v":""},{"$f":"IF(AA55>0,COUNTIFS(Data!$Q$3:$Q$99780,\">=\"&AA50,Data!$Q$3:$Q$99780,\"<\"&AA51,Data!$DY$3:$DY$99780,\"<4\",Data!$AE$3:$AE$99780,TRUE)/AA55,\"\")","v":""},{"$f":"IF(AB55>0,COUNTIFS(Data!$Q$3:$Q$99780,\">=\"&AB50,Data!$Q$3:$Q$99780,\"<\"&AB51,Data!$DY$3:$DY$99780,\"<4\",Data!$AE$3:$AE$99780,TRUE)/AB55,\"\")","v":""},{"$f":"IF(AC55>0,COUNTIFS(Data!$Q$3:$Q$99780,\">=\"&AC50,Data!$Q$3:$Q$99780,\"<\"&AC51,Data!$DY$3:$DY$99780,\"<4\",Data!$AE$3:$AE$99780,TRUE)/AC55,\"\")","v":""},{"$f":"IF(AD55>0,COUNTIFS(Data!$Q$3:$Q$99780,\">=\"&AD50,Data!$Q$3:$Q$99780,\"<\"&AD51,Data!$DY$3:$DY$99780,\"<4\",Data!$AE$3:$AE$99780,TRUE)/AD55,\"\")","v":""},{"$f":"IF(AE55>0,COUNTIFS(Data!$Q$3:$Q$99780,\">=\"&AE50,Data!$Q$3:$Q$99780,\"<\"&AE51,Data!$DY$3:$DY$99780,\"<4\",Data!$AE$3:$AE$99780,TRUE)/AE55,\"\")","v":""},{"$f":"IF(AF55>0,COUNTIFS(Data!$Q$3:$Q$99780,\">=\"&AF50,Data!$Q$3:$Q$99780,\"<\"&AF51,Data!$DY$3:$DY$99780,\"<4\",Data!$AE$3:$AE$99780,TRUE)/AF55,\"\")","v":""},{"$f":"IF(AG55>0,COUNTIFS(Data!$Q$3:$Q$99780,\">=\"&AG50,Data!$Q$3:$Q$99780,\"<\"&AG51,Data!$DY$3:$DY$99780,\"<4\",Data!$AE$3:$AE$99780,TRUE)/AG55,\"\")","v":""},{"$f":"IF(AH55>0,COUNTIFS(Data!$Q$3:$Q$99780,\">=\"&AH50,Data!$Q$3:$Q$99780,\"<\"&AH51,Data!$DY$3:$DY$99780,\"<4\",Data!$AE$3:$AE$99780,TRUE)/AH55,\"\")","v":""},{"$f":"IF(AI55>0,COUNTIFS(Data!$Q$3:$Q$99780,\">=\"&AI50,Data!$Q$3:$Q$99780,\"<\"&AI51,Data!$DY$3:$DY$99780,\"<4\",Data!$AE$3:$AE$99780,TRUE)/AI55,\"\")","v":""},{"$f":"IF(AJ55>0,COUNTIFS(Data!$Q$3:$Q$99780,\">=\"&AJ50,Data!$Q$3:$Q$99780,\"<\"&AJ51,Data!$DY$3:$DY$99780,\"<4\",Data!$AE$3:$AE$99780,TRUE)/AJ55,\"\")","v":""},{"$f":"IF(AK55>0,COUNTIFS(Data!$Q$3:$Q$99780,\">=\"&AK50,Data!$Q$3:$Q$99780,\"<\"&AK51,Data!$DY$3:$DY$99780,\"<4\",Data!$AE$3:$AE$99780,TRUE)/AK55,\"\")","v":""},{"$f":"IF(AL55>0,COUNTIFS(Data!$Q$3:$Q$99780,\">=\"&AL50,Data!$Q$3:$Q$99780,\"<\"&AL51,Data!$DY$3:$DY$99780,\"<4\",Data!$AE$3:$AE$99780,TRUE)/AL55,\"\")","v":""}]
["S1 within 2 months",{"$f":"IF(B57>0,COUNTIFS(Data!$O$3:$O$99780,\">=\"&B50,Data!$O$3:$O$99780,\"<\"&B51,Data!$DX$3:$DX$99780,\"<2\",Data!$AE$3:$AE$99780,TRUE)/B57,\"\")","v":""},{"$f":"IF(C57>0,COUNTIFS(Data!$O$3:$O$99780,\">=\"&C50,Data!$O$3:$O$99780,\"<\"&C51,Data!$DX$3:$DX$99780,\"<2\",Data!$AE$3:$AE$99780,TRUE)/C57,\"\")","v":""},{"$f":"IF(D57>0,COUNTIFS(Data!$O$3:$O$99780,\">=\"&D50,Data!$O$3:$O$99780,\"<\"&D51,Data!$DX$3:$DX$99780,\"<2\",Data!$AE$3:$AE$99780,TRUE)/D57,\"\")","v":""},{"$f":"IF(E57>0,COUNTIFS(Data!$O$3:$O$99780,\">=\"&E50,Data!$O$3:$O$99780,\"<\"&E51,Data!$DX$3:$DX$99780,\"<2\",Data!$AE$3:$AE$99780,TRUE)/E57,\"\")","v":""},{"$f":"IF(F57>0,COUNTIFS(Data!$O$3:$O$99780,\">=\"&F50,Data!$O$3:$O$99780,\"<\"&F51,Data!$DX$3:$DX$99780,\"<2\",Data!$AE$3:$AE$99780,TRUE)/F57,\"\")","v":""},{"$f":"IF(G57>0,COUNTIFS(Data!$O$3:$O$99780,\">=\"&G50,Data!$O$3:$O$99780,\"<\"&G51,Data!$DX$3:$DX$99780,\"<2\",Data!$AE$3:$AE$99780,TRUE)/G57,\"\")","v":""},{"$f":"IF(H57>0,COUNTIFS(Data!$O$3:$O$99780,\">=\"&H50,Data!$O$3:$O$99780,\"<\"&H51,Data!$DX$3:$DX$99780,\"<2\",Data!$AE$3:$AE$99780,TRUE)/H57,\"\")","v":""},{"$f":"IF(I57>0,COUNTIFS(Data!$O$3:$O$99780,\">=\"&I50,Data!$O$3:$O$99780,\"<\"&I51,Data!$DX$3:$DX$99780,\"<2\",Data!$AE$3:$AE$99780,TRUE)/I57,\"\")","v":""},{"$f":"IF(J57>0,COUNTIFS(Data!$O$3:$O$99780,\">=\"&J50,Data!$O$3:$O$99780,\"<\"&J51,Data!$DX$3:$DX$99780,\"<2\",Data!$AE$3:$AE$99780,TRUE)/J57,\"\")","v":""},{"$f":"IF(K57>0,COUNTIFS(Data!$O$3:$O$99780,\">=\"&K50,Data!$O$3:$O$99780,\"<\"&K51,Data!$DX$3:$DX$99780,\"<2\",Data!$AE$3:$AE$99780,TRUE)/K57,\"\")","v":""},{"$f":"IF(L57>0,COUNTIFS(Data!$O$3:$O$99780,\">=\"&L50,Data!$O$3:$O$99780,\"<\"&L51,Data!$DX$3:$DX$99780,\"<2\",Data!$AE$3:$AE$99780,TRUE)/L57,\"\")","v":""},{"$f":"IF(M57>0,COUNTIFS(Data!$O$3:$O$99780,\">=\"&M50,Data!$O$3:$O$99780,\"<\"&M51,Data!$DX$3:$DX$99780,\"<2\",Data!$AE$3:$AE$99780,TRUE)/M57,\"\")","v":""},{"$f":"IF(N57>0,COUNTIFS(Data!$O$3:$O$99780,\">=\"&N50,Data!$O$3:$O$99780,\"<\"&N51,Data!$DX$3:$DX$99780,\"<2\",Data!$AE$3:$AE$99780,TRUE)/N57,\"\")","v":""},{"$f":"IF(O57>0,COUNTIFS(Data!$O$3:$O$99780,\">=\"&O50,Data!$O$3:$O$99780,\"<\"&O51,Data!$DX$3:$DX$99780,\"<2\",Data!$AE$3:$AE$99780,TRUE)/O57,\"\")","v":""},{"$f":"IF(P57>0,COUNTIFS(Data!$O$3:$O$99780,\">=\"&P50,Data!$O$3:$O$99780,\"<\"&P51,Data!$DX$3:$DX$99780,\"<2\",Data!$AE$3:$AE$99780,TRUE)/P57,\"\")","v":""},{"$f":"IF(Q57>0,COUNTIFS(Data!$O$3:$O$99780,\">=\"&Q50,Data!$O$3:$O$99780,\"<\"&Q51,Data!$DX$3:$DX$99780,\"<2\",Data!$AE$3:$AE$99780,TRUE)/Q57,\"\")","v":""},{"$f":"IF(R57>0,COUNTIFS(Data!$O$3:$O$99780,\">=\"&R50,Data!$O$3:$O$99780,\"<\"&R51,Data!$DX$3:$DX$99780,\"<2\",Data!$AE$3:$AE$99780,TRUE)/R57,\"\")","v":""},{"$f":"IF(S57>0,COUNTIFS(Data!$O$3:$O$99780,\">=\"&S50,Data!$O$3:$O$99780,\"<\"&S51,Data!$DX$3:$DX$99780,\"<2\",Data!$AE$3:$AE$99780,TRUE)/S57,\"\")","v":""},{"$f":"IF(T57>0,COUNTIFS(Data!$O$3:$O$99780,\">=\"&T50,Data!$O$3:$O$99780,\"<\"&T51,Data!$DX$3:$DX$99780,\"<2\",Data!$AE$3:$AE$99780,TRUE)/T57,\"\")","v":""},{"$f":"IF(U57>0,COUNTIFS(Data!$O$3:$O$99780,\">=\"&U50,Data!$O$3:$O$99780,\"<\"&U51,Data!$DX$3:$DX$99780,\"<2\",Data!$AE$3:$AE$99780,TRUE)/U57,\"\")","v":""},{"$f":"IF(V57>0,COUNTIFS(Data!$O$3:$O$99780,\">=\"&V50,Data!$O$3:$O$99780,\"<\"&V51,Data!$DX$3:$DX$99780,\"<2\",Data!$AE$3:$AE$99780,TRUE)/V57,\"\")","v":""},{"$f":"IF(W57>0,COUNTIFS(Data!$O$3:$O$99780,\">=\"&W50,Data!$O$3:$O$99780,\"<\"&W51,Data!$DX$3:$DX$99780,\"<2\",Data!$AE$3:$AE$99780,TRUE)/W57,\"\")","v":""},{"$f":"IF(X57>0,COUNTIFS(Data!$O$3:$O$99780,\">=\"&X50,Data!$O$3:$O$99780,\"<\"&X51,Data!$DX$3:$DX$99780,\"<2\",Data!$AE$3:$AE$99780,TRUE)/X57,\"\")","v":""},{"$f":"IF(Y57>0,COUNTIFS(Data!$O$3:$O$99780,\">=\"&Y50,Data!$O$3:$O$99780,\"<\"&Y51,Data!$DX$3:$DX$99780,\"<2\",Data!$AE$3:$AE$99780,TRUE)/Y57,\"\")","v":""},{"$f":"IF(Z57>0,COUNTIFS(Data!$O$3:$O$99780,\">=\"&Z50,Data!$O$3:$O$99780,\"<\"&Z51,Data!$DX$3:$DX$99780,\"<2\",Data!$AE$3:$AE$99780,TRUE)/Z57,\"\")","v":""},{"$f":"IF(AA57>0,COUNTIFS(Data!$O$3:$O$99780,\">=\"&AA50,Data!$O$3:$O$99780,\"<\"&AA51,Data!$DX$3:$DX$99780,\"<2\",Data!$AE$3:$AE$99780,TRUE)/AA57,\"\")","v":""},{"$f":"IF(AB57>0,COUNTIFS(Data!$O$3:$O$99780,\">=\"&AB50,Data!$O$3:$O$99780,\"<\"&AB51,Data!$DX$3:$DX$99780,\"<2\",Data!$AE$3:$AE$99780,TRUE)/AB57,\"\")","v":""},{"$f":"IF(AC57>0,COUNTIFS(Data!$O$3:$O$99780,\">=\"&AC50,Data!$O$3:$O$99780,\"<\"&AC51,Data!$DX$3:$DX$99780,\"<2\",Data!$AE$3:$AE$99780,TRUE)/AC57,\"\")","v":""},{"$f":"IF(AD57>0,COUNTIFS(Data!$O$3:$O$99780,\">=\"&AD50,Data!$O$3:$O$99780,\"<\"&AD51,Data!$DX$3:$DX$99780,\"<2\",Data!$AE$3:$AE$99780,TRUE)/AD57,\"\")","v":""},{"$f":"IF(AE57>0,COUNTIFS(Data!$O$3:$O$99780,\">=\"&AE50,Data!$O$3:$O$99780,\"<\"&AE51,Data!$DX$3:$DX$99780,\"<2\",Data!$AE$3:$AE$99780,TRUE)/AE57,\"\")","v":""},{"$f":"IF(AF57>0,COUNTIFS(Data!$O$3:$O$99780,\">=\"&AF50,Data!$O$3:$O$99780,\"<\"&AF51,Data!$DX$3:$DX$99780,\"<2\",Data!$AE$3:$AE$99780,TRUE)/AF57,\"\")","v":""},{"$f":"IF(AG57>0,COUNTIFS(Data!$O$3:$O$99780,\">=\"&AG50,Data!$O$3:$O$99780,\"<\"&AG51,Data!$DX$3:$DX$99780,\"<2\",Data!$AE$3:$AE$99780,TRUE)/AG57,\"\")","v":""},{"$f":"IF(AH57>0,COUNTIFS(Data!$O$3:$O$99780,\">=\"&AH50,Data!$O$3:$O$99780,\"<\"&AH51,Data!$DX$3:$DX$99780,\"<2\",Data!$AE$3:$AE$99780,TRUE)/AH57,\"\")","v":""},{"$f":"IF(AI57>0,COUNTIFS(Data!$O$3:$O$99780,\">=\"&AI50,Data!$O$3:$O$99780,\"<\"&AI51,Data!$DX$3:$DX$99780,\"<2\",Data!$AE$3:$AE$99780,TRUE)/AI57,\"\")","v":""},{"$f":"IF(AJ57>0,COUNTIFS(Data!$O$3:$O$99780,\">=\"&AJ50,Data!$O$3:$O$99780,\"<\"&AJ51,Data!$DX$3:$DX$99780,\"<2\",Data!$AE$3:$AE$99780,TRUE)/AJ57,\"\")","v":""},{"$f":"IF(AK57>0,COUNTIFS(Data!$O$3:$O$99780,\">=\"&AK50,Data!$O$3:$O$99780,\"<\"&AK51,Data!$DX$3:$DX$99780,\"<2\",Data!$AE$3:$AE$99780,TRUE)/AK57,\"\")","v":""},{"$f":"IF(AL57>0,COUNTIFS(Data!$O$3:$O$99780,\">=\"&AL50,Data!$O$3:$O$99780,\"<\"&AL51,Data!$DX$3:$DX$99780,\"<2\",Data!$AE$3:$AE$99780,TRUE)/AL57,\"\")","v":""}]
["Approved and waiting"]
[]
["TIME WAITING","In S1",null,null,null,"S2 pending",null,null,null,"In S2",null,null,null,"Approved and waiting",null,null,null,"Child placed"]
["Over 2 months",{"$f":"COUNTIFS(Data!$EH$3:$EH$99780,\">=\"&C67,Data!$EH$3:$EH$99780,\"<=\"&D67,Data!$AE$3:$AE$99780,TRUE)","v":0},2,10000,"Over 6 months",{"$f":"COUNTIFS(Data!$EI$3:$EI$99780,\">=\"&G67,Data!$EI$3:$EI$99780,\"<=\"&H67,Data!$AE$3:$AE$99780,TRUE)","v":0},6,10000,"Over 1 year",{"$f":"COUNTIFS(Data!$EJ$3:$EJ$99780,\">=\"&K67,Data!$EJ$3:$EJ$99780,\"<=\"&L67,Data!$AE$3:$AE$99780,TRUE)","v":0},12,10000,"Over 1 year",{"$f":"COUNTIFS(Data!$EK$3:$EK$99780,\">=\"&O67,Data!$EK$3:$EK$99780,\"<=\"&P67,Data!$AE$3:$AE$99780,TRUE)","v":0},12,10000,"Over 1 year",{"$f":"COUNTIFS(Data!$EL$3:$EL$99780,\">=\"&S67,Data!$EL$3:$EL$99780,\"<=\"&T67,Data!$AE$3:$AE$99780,TRUE)","v":0},12,10000]
["Under 2 months",{"$f":"COUNTIFS(Data!$EH$3:$EH$99780,\">=\"&C68,Data!$EH$3:$EH$99780,\"<=\"&D68,Data!$AE$3:$AE$99780,TRUE)","v":0},0,1,"Under 6 months",{"$f":"COUNTIFS(Data!$EI$3:$EI$99780,\">=\"&G68,Data!$EI$3:$EI$99780,\"<=\"&H68,Data!$AE$3:$AE$99780,TRUE)","v":0},0,5,"8-12 months",{"$f":"COUNTIFS(Data!$EJ$3:$EJ$99780,\">=\"&K68,Data!$EJ$3:$EJ$99780,\"<=\"&L68,Data!$AE$3:$AE$99780,TRUE)","v":0},8,11,"9-12 months",{"$f":"COUNTIFS(Data!$EK$3:$EK$99780,\">=\"&O68,Data!$EK$3:$EK$99780,\"<=\"&P68,Data!$AE$3:$AE$99780,TRUE)","v":0},9,11,"9-12 months",{"$f":"COUNTIFS(Data!$EL$3:$EL$99780,\">=\"&S68,Data!$EL$3:$EL$99780,\"<=\"&T68,Data!$AE$3:$AE$99780,TRUE)","v":0},9,11]
[null,null,null,null,null,null,null,null,"4-8 months",{"$f":"COUNTIFS(Data!$EJ$3:$EJ$99780,\">=\"&K69,Data!$EJ$3:$EJ$99780,\"<=\"&L69,Data!$AE$3:$AE$99780,TRUE)","v":0},4,7,"6-9 months",{"$f":"COUNTIFS(Data!$EK$3:$EK$99780,\">=\"&O69,Data!$EK$3:$EK$99780,\"<=\"&P69,Data!$AE$3:$AE$99780,TRUE)","v":0},6,8,"6-9 months",{"$f":"COUNTIFS(Data!$EL$3:$EL$99780,\">=\"&S69,Data!$EL$3:$EL$99780,\"<=\"&T69,Data!$AE$3:$AE$99780,TRUE)","v":0},6,8]
[null,null,null,null,null,null,null,null,"Under 4 months",{"$f":"COUNTIFS(Data!$EJ$3:$EJ$99780,\">=\"&K70,Data!$EJ$3:$EJ$99780,\"<=\"&L70,Data!$AE$3:$AE$99780,TRUE)","v":0},0,3,"3-6 months",{"$f":"COUNTIFS(Data!$EK$3:$EK$99780,\">=\"&O70,Data!$EK$3:$EK$99780,\"<=\"&P70,Data!$AE$3:$AE$99780,TRUE)","v":0},3,5,"3-6 months",{"$f":"COUNTIFS(Data!$EL$3:$EL$99780,\">=\"&S70,Data!$EL$3:$EL$99780,\"<=\"&T70,Data!$AE$3:$AE$99780,TRUE)","v":0},3,4]
[null,null,null,null,null,null,null,null,null,null,null,null,"Under 3 months",{"$f":"COUNTIFS(Data!$EK$3:$EK$99780,\">=\"&O71,Data!$EK$3:$EK$99780,\"<=\"&P71,Data!$AE$3:$AE$99780,TRUE)","v":0},0,2,"Under 3 months",{"$f":"COUNTIFS(Data!$EL$3:$EL$99780,\">=\"&S71,Data!$EL$3:$EL$99780,\"<=\"&T71,Data!$AE$3:$AE$99780,TRUE)","v":0},0,2]
["On hold",{"$f":"COUNTIFS(Data!$X$3:$X$99780,2,Data!$Z$3:$Z$99780,\"\",Data!$AE$3:$AE$99780,TRUE,Data!$DL$3:$DL$99780,TRUE)","v":0},null,null,null,null,null,null,null,{"$f":"COUNTIFS(Data!$X$3:$X$99780,2,Data!$Z$3:$Z$99780,\"\"&L72,Data!$AE$3:$AE$99780,TRUE,Data!$DN$3:$DN$99780,TRUE)","v":0},null,null,null,{"$f":"COUNTIFS(Data!$X$3:$X$99780,2,Data!$Z$3:$Z$99780,\"\"&P72,Data!$AE$3:$AE$99780,TRUE,Data!$DV$3:$DV$99780,TRUE)","v":0}]
[]
["S1 cumulative timeframe",{"$f":"COUNTIFS(Data!$O$3:$O$99780,\">=\"&C2,Data!$O$3:$O$99780,\"<\"&B2,Data!$AE$3:$AE$99780,TRUE)","v":0}]
[0,1,2,3,4,5,6,7,8,9,10,11,12,13,14,15,16,17,18,19,20,21,22,23,24,25,26]
[0,{"$f":"COUNTIFS(Data!$O$3:$O$99780,\">=\"&$C$2,Data!$O$3:$O$99780,\"<\"&$B$2,Data!$DX$3:$DX$99780,\"<\"&B75,Data!$AE$3:$AE$99780,TRUE)/$B$74","v":{"$error":"#DIV/0!"}},{"$f":"COUNTIFS(Data!$O$3:$O$99780,\">=\"&$C$2,Data!$O$3:$O$99780,\"<\"&$B$2,Data!$DX$3:$DX$99780,\"<\"&C75,Data!$AE$3:$AE$99780,TRUE)/$B$74","v":{"$error":"#DIV/0!"}},{"$f":"COUNTIFS(Data!$O$3:$O$99780,\">=\"&$C$2,Data!$O$3:$O$99780,\"<\"&$B$2,Data!$DX$3:$DX$99780,\"<\"&D75,Data!$AE$3:$AE$99780,TRUE)/$B$74","v":{"$error":"#DIV/0!"}},{"$f":"COUNTIFS(Data!$O$3:$O$99780,\">=\"&$C$2,Data!$O$3:$O$99780,\"<\"&$B$2,Data!$DX$3:$DX$99780,\"<\"&E75,Data!$AE$3:$AE$99780,TRUE)/$B$74","v":{"$error":"#DIV/0!"}},{"$f":"COUNTIFS(Data!$O$3:$O$99780,\">=\"&$C$2,Data!$O$3:$O$99780,\"<\"&$B$2,Data!$DX$3:$DX$99780,\"<\"&F75,Data!$AE$3:$AE$99780,TRUE)/$B$74","v":{"$error":"#DIV/0!"}},{"$f":"COUNTIFS(Data!$O$3:$O$99780,\">=\"&$C$2,Data!$O$3:$O$99780,\"<\"&$B$2,Data!$DX$3:$DX$99780,\"<\"&G75,Data!$AE$3:$AE$99780,TRUE)/$B$74","v":{"$error":"#DIV/0!"}},{"$f":"COUNTIFS(Data!$O$3:$O$99780,\">=\"&$C$2,Data!$O$3:$O$99780,\"<\"&$B$2,Data!$DX$3:$DX$99780,\"<\"&H75,Data!$AE$3:$AE$99780,TRUE)/$B$74","v":{"$error":"#DIV/0!"}},{"$f":"COUNTIFS(Data!$O$3:$O$99780,\">=\"&$C$2,Data!$O$3:$O$99780,\"<\"&$B$2,Data!$DX$3:$DX$99780,\"<\"&I75,Data!$AE$3:$AE$99780,TRUE)/$B$74","v":{"$error":"#DIV/0!"}},{"$f":"COUNTIFS(Data!$O$3:$O$99780,\">=\"&$C$2,Data!$O$3:$O$99780,\"<\"&$B$2,Data!$DX$3:$DX$99780,\"<\"&J75,Data!$AE$3:$AE$99780,TRUE)/$B$74","v":{"$error":"#DIV/0!"}},{"$f":"COUNTIFS(Data!$O$3:$O$99780,\">=\"&$C$2,Data!$O$3:$O$99780,\"<\"&$B$2,Data!$DX$3:$DX$99780,\"<\"&K75,Data!$AE$3:$AE$99780,TRUE)/$B$74","v":{"$error":"#DIV/0!"}},{"$f":"COUNTIFS(Data!$O$3:$O$99780,\">=\"&$C$2,Data!$O$3:$O$99780,\"<\"&$B$2,Data!$DX$3:$DX$99780,\"<\"&L75,Data!$AE$3:$AE$99780,TRUE)/$B$74","v":{"$error":"#DIV/0!"}},{"$f":"COUNTIFS(Data!$O$3:$O$99780,\">=\"&$C$2,Data!$O$3:$O$99780,\"<\"&$B$2,Data!$DX$3:$DX$99780,\"<\"&M75,Data!$AE$3:$AE$99780,TRUE)/$B$74","v":{"$error":"#DIV/0!"}},{"$f":"COUNTIFS(Data!$O$3:$O$99780,\">=\"&$C$2,Data!$O$3:$O$99780,\"<\"&$B$2,Data!$DX$3:$DX$99780,\"<\"&N75,Data!$AE$3:$AE$99780,TRUE)/$B$74","v":{"$error":"#DIV/0!"}},{"$f":"COUNTIFS(Data!$O$3:$O$99780,\">=\"&$C$2,Data!$O$3:$O$99780,\"<\"&$B$2,Data!$DX$3:$DX$99780,\"<\"&O75,Data!$AE$3:$AE$99780,TRUE)/$B$74","v":{"$error":"#DIV/0!"}},{"$f":"COUNTIFS(Data!$O$3:$O$99780,\">=\"&$C$2,Data!$O$3:$O$99780,\"<\"&$B$2,Data!$DX$3:$DX$99780,\"<\"&P75,Data!$AE$3:$AE$99780,TRUE)/$B$74","v":{"$error":"#DIV/0!"}},{"$f":"COUNTIFS(Data!$O$3:$O$99780,\">=\"&$C$2,Data!$O$3:$O$99780,\"<\"&$B$2,Data!$DX$3:$DX$99780,\"<\"&Q75,Data!$AE$3:$AE$99780,TRUE)/$B$74","v":{"$error":"#DIV/0!"}},{"$f":"COUNTIFS(Data!$O$3:$O$99780,\">=\"&$C$2,Data!$O$3:$O$99780,\"<\"&$B$2,Data!$DX$3:$DX$99780,\"<\"&R75,Data!$AE$3:$AE$99780,TRUE)/$B$74","v":{"$error":"#DIV/0!"}},{"$f":"COUNTIFS(Data!$O$3:$O$99780,\">=\"&$C$2,Data!$O$3:$O$99780,\"<\"&$B$2,Data!$DX$3:$DX$99780,\"<\"&S75,Data!$AE$3:$AE$99780,TRUE)/$B$74","v":{"$error":"#DIV/0!"}},{"$f":"COUNTIFS(Data!$O$3:$O$99780,\">=\"&$C$2,Data!$O$3:$O$99780,\"<\"&$B$2,Data!$DX$3:$DX$99780,\"<\"&T75,Data!$AE$3:$AE$99780,TRUE)/$B$74","v":{"$error":"#DIV/0!"}},{"$f":"COUNTIFS(Data!$O$3:$O$99780,\">=\"&$C$2,Data!$O$3:$O$99780,\"<\"&$B$2,Data!$DX$3:$DX$99780,\"<\"&U75,Data!$AE$3:$AE$99780,TRUE)/$B$74","v":{"$error":"#DIV/0!"}},{"$f":"COUNTIFS(Data!$O$3:$O$99780,\">=\"&$C$2,Data!$O$3:$O$99780,\"<\"&$B$2,Data!$DX$3:$DX$99780,\"<\"&V75,Data!$AE$3:$AE$99780,TRUE)/$B$74","v":{"$error":"#DIV/0!"}},{"$f":"COUNTIFS(Data!$O$3:$O$99780,\">=\"&$C$2,Data!$O$3:$O$99780,\"<\"&$B$2,Data!$DX$3:$DX$99780,\"<\"&W75,Data!$AE$3:$AE$99780,TRUE)/$B$74","v":{"$error":"#DIV/0!"}},{"$f":"COUNTIFS(Data!$O$3:$O$99780,\">=\"&$C$2,Data!$O$3:$O$99780,\"<\"&$B$2,Data!$DX$3:$DX$99780,\"<\"&X75,Data!$AE$3:$AE$99780,TRUE)/$B$74","v":{"$error":"#DIV/0!"}},{"$f":"COUNTIFS(Data!$O$3:$O$99780,\">=\"&$C$2,Data!$O$3:$O$99780,\"<\"&$B$2,Data!$DX$3:$DX$99780,\"<\"&Y75,Data!$AE$3:$AE$99780,TRUE)/$B$74","v":{"$error":"#DIV/0!"}},{"$f":"COUNTIFS(Data!$O$3:$O$99780,\">=\"&$C$2,Data!$O$3:$O$99780,\"<\"&$B$2,Data!$DX$3:$DX$99780,\"<\"&Z75,Data!$AE$3:$AE$99780,TRUE)/$B$74","v":{"$error":"#DIV/0!"}},{"$f":"COUNTIFS(Data!$O$3:$O$99780,\">=\"&$C$2,Data!$O$3:$O$99780,\"<\"&$B$2,Data!$DX$3:$DX$99780,\"<\"&AA75,Data!$AE$3:$AE$99780,TRUE)/$B$74","v":{"$error":"#DIV/0!"}}]
[]
["S2 cumulative timeframe",{"$f":"COUNTIFS(Data!$Q$3:$Q$99780,\">=\"&C2,Data!$Q$3:$Q$99780,\"<\"&B2,Data!$AE$3:$AE$99780,TRUE)","v":0}]
[0,1,2,3,4,5,6,7,8,9,10,11,12,13,14,15,16,17,18,19,20,21,22,23,24,25,26]
[0,{"$f":"COUNTIFS(Data!$Q$3:$Q$99780,\">=\"&$C$2,Data!$Q$3:$Q$99780,\"<\"&$B$2,Data!$DY$3:$DY$99780,\"<\"&B79,Data!$AE$3:$AE$99780,TRUE)/$B$78","v":{"$error":"#DIV/0!"}},{"$f":"COUNTIFS(Data!$Q$3:$Q$99780,\">=\"&$C$2,Data!$Q$3:$Q$99780,\"<\"&$B$2,Data!$DY$3:$DY$99780,\"<\"&C79,Data!$AE$3:$AE$99780,TRUE)/$B$78","v":{"$error":"#DIV/0!"}},{"$f":"COUNTIFS(Data!$Q$3:$Q$99780,\">=\"&$C$2,Data!$Q$3:$Q$99780,\"<\"&$B$2,Data!$DY$3:$DY$99780,\"<\"&D79,Data!$AE$3:$AE$99780,TRUE)/$B$78","v":{"$error":"#DIV/0!"}},{"$f":"COUNTIFS(Data!$Q$3:$Q$99780,\">=\"&$C$2,Data!$Q$3:$Q$99780,\"<\"&$B$2,Data!$DY$3:$DY$99780,\"<\"&E79,Data!$AE$3:$AE$99780,TRUE)/$B$78","v":{"$error":"#DIV/0!"}},{"$f":"COUNTIFS(Data!$Q$3:$Q$99780,\">=\"&$C$2,Data!$Q$3:$Q$99780,\"<\"&$B$2,Data!$DY$3:$DY$99780,\"<\"&F79,Data!$AE$3:$AE$99780,TRUE)/$B$78","v":{"$error":"#DIV/0!"}},{"$f":"COUNTIFS(Data!$Q$3:$Q$99780,\">=\"&$C$2,Data!$Q$3:$Q$99780,\"<\"&$B$2,Data!$DY$3:$DY$99780,\"<\"&G79,Data!$AE$3:$AE$99780,TRUE)/$B$78","v":{"$error":"#DIV/0!"}},{"$f":"COUNTIFS(Data!$Q$3:$Q$99780,\">=\"&$C$2,Data!$Q$3:$Q$99780,\"<\"&$B$2,Data!$DY$3:$DY$99780,\"<\"&H79,Data!$AE$3:$AE$99780,TRUE)/$B$78","v":{"$error":"#DIV/0!"}},{"$f":"COUNTIFS(Data!$Q$3:$Q$99780,\">=\"&$C$2,Data!$Q$3:$Q$99780,\"<\"&$B$2,Data!$DY$3:$DY$99780,\"<\"&I79,Data!$AE$3:$AE$99780,TRUE)/$B$78","v":{"$error":"#DIV/0!"}},{"$f":"COUNTIFS(Data!$Q$3:$Q$99780,\">=\"&$C$2,Data!$Q$3:$Q$99780,\"<\"&$B$2,Data!$DY$3:$DY$99780,\"<\"&J79,Data!$AE$3:$AE$99780,TRUE)/$B$78","v":{"$error":"#DIV/0!"}},{"$f":"COUNTIFS(Data!$Q$3:$Q$99780,\">=\"&$C$2,Data!$Q$3:$Q$99780,\"<\"&$B$2,Data!$DY$3:$DY$99780,\"<\"&K79,Data!$AE$3:$AE$99780,TRUE)/$B$78","v":{"$error":"#DIV/0!"}},{"$f":"COUNTIFS(Data!$Q$3:$Q$99780,\">=\"&$C$2,Data!$Q$3:$Q$99780,\"<\"&$B$2,Data!$DY$3:$DY$99780,\"<\"&L79,Data!$AE$3:$AE$99780,TRUE)/$B$78","v":{"$error":"#DIV/0!"}},{"$f":"COUNTIFS(Data!$Q$3:$Q$99780,\">=\"&$C$2,Data!$Q$3:$Q$99780,\"<\"&$B$2,Data!$DY$3:$DY$99780,\"<\"&M79,Data!$AE$3:$AE$99780,TRUE)/$B$78","v":{"$error":"#DIV/0!"}},{"$f":"COUNTIFS(Data!$Q$3:$Q$99780,\">=\"&$C$2,Data!$Q$3:$Q$99780,\"<\"&$B$2,Data!$DY$3:$DY$99780,\"<\"&N79,Data!$AE$3:$AE$99780,TRUE)/$B$78","v":{"$error":"#DIV/0!"}},{"$f":"COUNTIFS(Data!$Q$3:$Q$99780,\">=\"&$C$2,Data!$Q$3:$Q$99780,\"<\"&$B$2,Data!$DY$3:$DY$99780,\"<\"&O79,Data!$AE$3:$AE$99780,TRUE)/$B$78","v":{"$error":"#DIV/0!"}},{"$f":"COUNTIFS(Data!$Q$3:$Q$99780,\">=\"&$C$2,Data!$Q$3:$Q$99780,\"<\"&$B$2,Data!$DY$3:$DY$99780,\"<\"&P79,Data!$AE$3:$AE$99780,TRUE)/$B$78","v":{"$error":"#DIV/0!"}},{"$f":"COUNTIFS(Data!$Q$3:$Q$99780,\">=\"&$C$2,Data!$Q$3:$Q$99780,\"<\"&$B$2,Data!$DY$3:$DY$99780,\"<\"&Q79,Data!$AE$3:$AE$99780,TRUE)/$B$78","v":{"$error":"#DIV/0!"}},{"$f":"COUNTIFS(Data!$Q$3:$Q$99780,\">=\"&$C$2,Data!$Q$3:$Q$99780,\"<\"&$B$2,Data!$DY$3:$DY$99780,\"<\"&R79,Data!$AE$3:$AE$99780,TRUE)/$B$78","v":{"$error":"#DIV/0!"}},{"$f":"COUNTIFS(Data!$Q$3:$Q$99780,\">=\"&$C$2,Data!$Q$3:$Q$99780,\"<\"&$B$2,Data!$DY$3:$DY$99780,\"<\"&S79,Data!$AE$3:$AE$99780,TRUE)/$B$78","v":{"$error":"#DIV/0!"}},{"$f":"COUNTIFS(Data!$Q$3:$Q$99780,\">=\"&$C$2,Data!$Q$3:$Q$99780,\"<\"&$B$2,Data!$DY$3:$DY$99780,\"<\"&T79,Data!$AE$3:$AE$99780,TRUE)/$B$78","v":{"$error":"#DIV/0!"}},{"$f":"COUNTIFS(Data!$Q$3:$Q$99780,\">=\"&$C$2,Data!$Q$3:$Q$99780,\"<\"&$B$2,Data!$DY$3:$DY$99780,\"<\"&U79,Data!$AE$3:$AE$99780,TRUE)/$B$78","v":{"$error":"#DIV/0!"}},{"$f":"COUNTIFS(Data!$Q$3:$Q$99780,\">=\"&$C$2,Data!$Q$3:$Q$99780,\"<\"&$B$2,Data!$DY$3:$DY$99780,\"<\"&V79,Data!$AE$3:$AE$99780,TRUE)/$B$78","v":{"$error":"#DIV/0!"}},{"$f":"COUNTIFS(Data!$Q$3:$Q$99780,\">=\"&$C$2,Data!$Q$3:$Q$99780,\"<\"&$B$2,Data!$DY$3:$DY$99780,\"<\"&W79,Data!$AE$3:$AE$99780,TRUE)/$B$78","v":{"$error":"#DIV/0!"}},{"$f":"COUNTIFS(Data!$Q$3:$Q$99780,\">=\"&$C$2,Data!$Q$3:$Q$99780,\"<\"&$B$2,Data!$DY$3:$DY$99780,\"<\"&X79,Data!$AE$3:$AE$99780,TRUE)/$B$78","v":{"$error":"#DIV/0!"}},{"$f":"COUNTIFS(Data!$Q$3:$Q$99780,\">=\"&$C$2,Data!$Q$3:$Q$99780,\"<\"&$B$2,Data!$DY$3:$DY$99780,\"<\"&Y79,Data!$AE$3:$AE$99780,TRUE)/$B$78","v":{"$error":"#DIV/0!"}},{"$f":"COUNTIFS(Data!$Q$3:$Q$99780,\">=\"&$C$2,Data!$Q$3:$Q$99780,\"<\"&$B$2,Data!$DY$3:$DY$99780,\"<\"&Z79,Data!$AE$3:$AE$99780,TRUE)/$B$78","v":{"$error":"#DIV/0!"}},{"$f":"COUNTIFS(Data!$Q$3:$Q$99780,\">=\"&$C$2,Data!$Q$3:$Q$99780,\"<\"&$B$2,Data!$DY$3:$DY$99780,\"<\"&AA79,Data!$AE$3:$AE$99780,TRUE)/$B$78","v":{"$error":"#DIV/0!"}}]
[]
["Matched cumulative timeframe"]
[0,1,2,3,4,5,6,7,8,9,10,11,12,13,14,15,16,17,18,19,20,21,22,23,24,25,26]
[0]
[]
["S1 timeframe",2]
["S2 timeframe",4]
[]
["Characteristics of adopters waiting",null,null,null,null,null,null,null,null,null,"Characteristics of adopters approved",null,null,null,null,null,null,null,null,"Characteristics of adopters matched",null,null,null,null,null,null,null,null,"Characteristics of adopters starting assessment"]
[]
["Bu",{"$f":"COUNTIFS(Data!$DV$3:$DV$99780,TRUE,Data!$E$3:$E$99780,A91)","v":0},"Bi",{"$f":"COUNTIFS(Data!$DV$3:$DV$99780,TRUE,Data!$F$3:$F$99780,C91)","v":0},"ABAN",{"$f":"COUNTIFS(Data!$DV$3:$DV$99780,TRUE,Data!$G$3:$G$99780,E91)","v":0},"CIV",{"$f":"COUNTIFS(Data!$DV$3:$DV$99780,TRUE,Data!$I$3:$I$99780,G91)","v":0},null,null,"Bu",{"$f":"COUNTIFS(Data!$Q$3:$Q$99780,\">=\"&SDate,Data!$Q$3:$Q$99780,\"<=\"&RDate,Data!$X$3:$X$99780,\"<>3\",Data!$E$3:$E$99780,K91)","v":0},"Bi",{"$f":"COUNTIFS(Data!$Q$3:$Q$99780,\">=\"&SDate,Data!$Q$3:$Q$99780,\"<=\"&RDate,Data!$X$3:$X$99780,\"<>3\",Data!$F$3:$F$99780,M91)","v":0},"ABAN",{"$f":"COUNTIFS(Data!$Q$3:$Q$99780,\">=\"&SDate,Data!$Q$3:$Q$99780,\"<=\"&RDate,Data!$X$3:$X$99780,\"<>3\",Data!$G$3:$G$99780,O91)","v":0},"CIV",{"$f":"COUNTIFS(Data!$Q$3:$Q$99780,\">=\"&SDate,Data!$Q$3:$Q$99780,\"<=\"&RDate,Data!$X$3:$X$99780,\"<>3\",Data!$I$3:$I$99780,Q91)","v":0},null,"Bu",{"$f":"COUNTIFS(Data!$R$3:$R$99780,\">=\"&SDate,Data!$R$3:$R$99780,\"<=\"&RDate,Data!$E$3:$E$99780,T91)","v":0},"Bi",{"$f":"COUNTIFS(Data!$R$3:$R$99780,\">=\"&SDate,Data!$R$3:$R$99780,\"<=\"&RDate,Data!$F$3:$F$99780,V91)","v":0},"ABAN",{"$f":"COUNTIFS(Data!$R$3:$R$99780,\">=\"&SDate,Data!$R$3:$R$99780,\"<=\"&RDate,Data!$G$3:$G$99780,X91)","v":0},"CIV",{"$f":"COUNTIFS(Data!$R$3:$R$99780,\">=\"&SDate,Data!$R$3:$R$99780,\"<=\"&RDate,Data!$I$3:$I$99780,Z91)","v":0},null,"Bu",{"$f":"COUNTIFS(Data!$DW$3:$DW$99780,\">=\"&SDate,Data!$DW$3:$DW$99780,\"<=\"&RDate,Data!$E$3:$E$99780,AC91)","v":0},"Bi",{"$f":"COUNTIFS(Data!$DW$3:$DW$99780,\">=\"&SDate,Data!$DW$3:$DW$99780,\"<=\"&RDate,Data!$F$3:$F$99780,AE91)","v":0},"ABAN",{"$f":"COUNTIFS(Data!$DW$3:$DW$99780,\">=\"&SDate,Data!$DW$3:$DW$99780,\"<=\"&RDate,Data!$G$3:$G$99780,AG91)","v":0},"CIV",{"$f":"COUNTIFS(Data!$DW$3:$DW$99780,\">=\"&SDate,Data!$DW$3:$DW$99780,\"<=\"&RDate,Data!$I$3:$I$99780,AI91)","v":0}]
["Ch",{"$f":"COUNTIFS(Data!$DV$3:$DV$99780,TRUE,Data!$E$3:$E$99780,A92)","v":0},"Ga",{"$f":"COUNTIFS(Data!$DV$3:$DV$99780,TRUE,Data!$F$3:$F$99780,C92)","v":0},"AIND",{"$f":"COUNTIFS(Data!$DV$3:$DV$99780,TRUE,Data!$G$3:$G$99780,E92)","v":0},"CLM",{"$f":"COUNTIFS(Data!$DV$3:$DV$99780,TRUE,Data!$I$3:$I$99780,G92)","v":0},null,null,"Ch",{"$f":"COUNTIFS(Data!$Q$3:$Q$99780,\">=\"&SDate,Data!$Q$3:$Q$99780,\"<=\"&RDate,Data!$X$3:$X$99780,\"<>3\",Data!$E$3:$E$99780,K92)","v":0},"Ga",{"$f":"COUNTIFS(Data!$Q$3:$Q$99780,\">=\"&SDate,Data!$Q$3:$Q$99780,\"<=\"&RDate,Data!$X$3:$X$99780,\"<>3\",Data!$F$3:$F$99780,M92)","v":0},"AIND",{"$f":"COUNTIFS(Data!$Q$3:$Q$99780,\">=\"&SDate,Data!$Q$3:$Q$99780,\"<=\"&RDate,Data!$X$3:$X$99780,\"<>3\",Data!$G$3:$G$99780,O92)","v":0},"CLM",{"$f":"COUNTIFS(Data!$Q$3:$Q$99780,\">=\"&SDate,Data!$Q$3:$Q$99780,\"<=\"&RDate,Data!$X$3:$X$99780,\"<>3\",Data!$I$3:$I$99780,Q92)","v":0},null,"Ch",{"$f":"COUNTIFS(Data!$R$3:$R$99780,\">=\"&SDate,Data!$R$3:$R$99780,\"<=\"&RDate,Data!$E$3:$E$99780,T92)","v":0},"Ga",{"$f":"COUNTIFS(Data!$R$3:$R$99780,\">=\"&SDate,Data!$R$3:$R$99780,\"<=\"&RDate,Data!$F$3:$F$99780,V92)","v":0},"AIND",{"$f":"COUNTIFS(Data!$R$3:$R$99780,\">=\"&SDate,Data!$R$3:$R$99780,\"<=\"&RDate,Data!$G$3:$G$99780,X92)","v":0},"CLM",{"$f":"COUNTIFS(Data!$R$3:$R$99780,\">=\"&SDate,Data!$R$3:$R$99780,\"<=\"&RDate,Data!$I$3:$I$99780,Z92)","v":0},null,"Ch",{"$f":"COUNTIFS(Data!$DW$3:$DW$99780,\">=\"&SDate,Data!$DW$3:$DW$99780,\"<=\"&RDate,Data!$E$3:$E$99780,AC92)","v":0},"Ga",{"$f":"COUNTIFS(Data!$DW$3:$DW$99780,\">=\"&SDate,Data!$DW$3:$DW$99780,\"<=\"&RDate,Data!$F$3:$F$99780,AE92)","v":0},"AIND",{"$f":"COUNTIFS(Data!$DW$3:$DW$99780,\">=\"&SDate,Data!$DW$3:$DW$99780,\"<=\"&RDate,Data!$G$3:$G$99780,AG92)","v":0},"CLM",{"$f":"COUNTIFS(Data!$DW$3:$DW$99780,\">=\"&SDate,Data!$DW$3:$DW$99780,\"<=\"&RDate,Data!$I$3:$I$99780,AI92)","v":0}]
["Hi",{"$f":"COUNTIFS(Data!$DV$3:$DV$99780,TRUE,Data!$E$3:$E$99780,A93)","v":0},"He",{"$f":"COUNTIFS(Data!$DV$3:$DV$99780,TRUE,Data!$F$3:$F$99780,C93)","v":0},"AOTH",{"$f":"COUNTIFS(Data!$DV$3:$DV$99780,TRUE,Data!$G$3:$G$99780,E93)","v":0},"MAR",{"$f":"COUNTIFS(Data!$DV$3:$DV$99780,TRUE,Data!$I$3:$I$99780,G93)","v":0},null,null,"Hi",{"$f":"COUNTIFS(Data!$Q$3:$Q$99780,\">=\"&SDate,Data!$Q$3:$Q$99780,\"<=\"&RDate,Data!$X$3:$X$99780,\"<>3\",Data!$E$3:$E$99780,K93)","v":0},"He",{"$f":"COUNTIFS(Data!$Q$3:$Q$99780,\">=\"&SDate,Data!$Q$3:$Q$99780,\"<=\"&RDate,Data!$X$3:$X$99780,\"<>3\",Data!$F$3:$F$99780,M93)","v":0},"AOTH",{"$f":"COUNTIFS(Data!$Q$3:$Q$99780,\">=\"&SDate,Data!$Q$3:$Q$99780,\"<=\"&RDate,Data!$X$3:$X$99780,\"<>3\",Data!$G$3:$G$99780,O93)","v":0},"MAR",{"$f":"COUNTIFS(Data!$Q$3:$Q$99780,\">=\"&SDate,Data!$Q$3:$Q$99780,\"<=\"&RDate,Data!$X$3:$X$99780,\"<>3\",Data!$I$3:$I$99780,Q93)","v":0},null,"Hi",{"$f":"COUNTIFS(Data!$R$3:$R$99780,\">=\"&SDate,Data!$R$3:$R$99780,\"<=\"&RDate,Data!$E$3:$E$99780,T93)","v":0},"He",{"$f":"COUNTIFS(Data!$R$3:$R$99780,\">=\"&SDate,Data!$R$3:$R$99780,\"<=\"&RDate,Data!$F$3:$F$99780,V93)","v":0},"AOTH",{"$f":"COUNTIFS(Data!$R$3:$R$99780,\">=\"&SDate,Data!$R$3:$R$99780,\"<=\"&RDate,Data!$G$3:$G$99780,X93)","v":0},"MAR",{"$f":"COUNTIFS(Data!$R$3:$R$99780,\">=\"&SDate,Data!$R$3:$R$99780,\"<=\"&RDate,Data!$I$3:$I$99780,Z93)","v":0},null,"Hi",{"$f":"COUNTIFS(Data!$DW$3:$DW$99780,\">=\"&SDate,Data!$DW$3:$DW$99780,\"<=\"&RDate,Data!$E$3:$E$99780,AC93)","v":0},"He",{"$f":"COUNTIFS(Data!$DW$3:$DW$99780,\">=\"&SDate,Data!$DW$3:$DW$99780,\"<=\"&RDate,Data!$F$3:$F$99780,AE93)","v":0},"AOTH",{"$f":"COUNTIFS(Data!$DW$3:$DW$99780,\">=\"&SDate,Data!$DW$3:$DW$99780,\"<=\"&RDate,Data!$G$3:$G$99780,AG93)","v":0},"MAR",{"$f":"COUNTIFS(Data!$DW$3:$DW$99780,\">=\"&SDate,Data!$DW$3:$DW$99780,\"<=\"&RDate,Data!$I$3:$I$99780,AI93)","v":0}]
["Je",{"$f":"COUNTIFS(Data!$DV$3:$DV$99780,TRUE,Data!$E$3:$E$99780,A94)","v":0},"Le",{"$f":"COUNTIFS(Data!$DV$3:$DV$99780,TRUE,Data!$F$3:$F$99780,C94)","v":0},"APKN",{"$f":"COUNTIFS(Data!$DV$3:$DV$99780,TRUE,Data!$G$3:$G$99780,E94)","v":0},"NOBT",{"$f":"COUNTIFS(Data!$DV$3:$DV$99780,TRUE,Data!$I$3:$I$99780,G94)","v":0},null,null,"Je",{"$f":"COUNTIFS(Data!$Q$3:$Q$99780,\">=\"&SDate,Data!$Q$3:$Q$99780,\"<=\"&RDate,Data!$X$3:$X$99780,\"<>3\",Data!$E$3:$E$99780,K94)","v":0},"Le",{"$f":"COUNTIFS(Data!$Q$3:$Q$99780,\">=\"&SDate,Data!$Q$3:$Q$99780,\"<=\"&RDate,Data!$X$3:$X$99780,\"<>3\",Data!$F$3:$F$99780,M94)","v":0},"APKN",{"$f":"COUNTIFS(Data!$Q$3:$Q$99780,\">=\"&SDate,Data!$Q$3:$Q$99780,\"<=\"&RDate,Data!$X$3:$X$99780,\"<>3\",Data!$G$3:$G$99780,O94)","v":0},"NOBT",{"$f":"COUNTIFS(Data!$Q$3:$Q$99780,\">=\"&SDate,Data!$Q$3:$Q$99780,\"<=\"&RDate,Data!$X$3:$X$99780,\"<>3\",Data!$I$3:$I$99780,Q94)","v":0},null,"Je",{"$f":"COUNTIFS(Data!$R$3:$R$99780,\">=\"&SDate,Data!$R$3:$R$99780,\"<=\"&RDate,Data!$E$3:$E$99780,T94)","v":0},"Le",{"$f":"COUNTIFS(Data!$R$3:$R$99780,\">=\"&SDate,Data!$R$3:$R$99780,\"<=\"&RDate,Data!$F$3:$F$99780,V94)","v":0},"APKN",{"$f":"COUNTIFS(Data!$R$3:$R$99780,\">=\"&SDate,Data!$R$3:$R$99780,\"<=\"&RDate,Data!$G$3:$G$99780,X94)","v":0},"NOBT",{"$f":"COUNTIFS(Data!$R$3:$R$99780,\">=\"&SDate,Data!$R$3:$R$99780,\"<=\"&RDate,Data!$I$3:$I$99780,Z94)","v":0},null,"Je",{"$f":"COUNTIFS(Data!$DW$3:$DW$99780,\">=\"&SDate,Data!$DW$3:$DW$99780,\"<=\"&RDate,Data!$E$3:$E$99780,AC94)","v":0},"Le",{"$f":"COUNTIFS(Data!$DW$3:$DW$99780,\">=\"&SDate,Data!$DW$3:$DW$99780,\"<=\"&RDate,Data!$F$3:$F$99780,AE94)","v":0},"APKN",{"$f":"COUNTIFS(Data!$DW$3:$DW$99780,\">=\"&SDate,Data!$DW$3:$DW$99780,\"<=\"&RDate,Data!$G$3:$G$99780,AG94)","v":0},"NOBT",{"$f":"COUNTIFS(Data!$DW$3:$DW$99780,\">=\"&SDate,Data!$DW$3:$DW$99780,\"<=\"&RDate,Data!$I$3:$I$99780,AI94)","v":0}]
["Mu",{"$f":"COUNTIFS(Data!$DV$3:$DV$99780,TRUE,Data!$E$3:$E$99780,A95)","v":0},"Na",{"$f":"COUNTIFS(Data!$DV$3:$DV$99780,TRUE,Data!$F$3:$F$99780,C95)","v":0},"BAFR",{"$f":"COUNTIFS(Data!$DV$3:$DV$99780,TRUE,Data!$G$3:$G$99780,E95)","v":0},"OTH",{"$f":"COUNTIFS(Data!$DV$3:$DV$99780,TRUE,Data!$I$3:$I$99780,G95)","v":0},null,null,"Mu",{"$f":"COUNTIFS(Data!$Q$3:$Q$99780,\">=\"&SDate,Data!$Q$3:$Q$99780,\"<=\"&RDate,Data!$X$3:$X$99780,\"<>3\",Data!$E$3:$E$99780,K95)","v":0},"Na",{"$f":"COUNTIFS(Data!$Q$3:$Q$99780,\">=\"&SDate,Data!$Q$3:$Q$99780,\"<=\"&RDate,Data!$X$3:$X$99780,\"<>3\",Data!$F$3:$F$99780,M95)","v":0},"BAFR",{"$f":"COUNTIFS(Data!$Q$3:$Q$99780,\">=\"&SDate,Data!$Q$3:$Q$99780,\"<=\"&RDate,Data!$X$3:$X$99780,\"<>3\",Data!$G$3:$G$99780,O95)","v":0},"OTH",{"$f":"COUNTIFS(Data!$Q$3:$Q$99780,\">=\"&SDate,Data!$Q$3:$Q$99780,\"<=\"&RDate,Data!$X$3:$X$99780,\"<>3\",Data!$I$3:$I$99780,Q95)","v":0},null,"Mu",{"$f":"COUNTIFS(Data!$R$3:$R$99780,\">=\"&SDate,Data!$R$3:$R$99780,\"<=\"&RDate,Data!$E$3:$E$99780,T95)","v":0},"Na",{"$f":"COUNTIFS(Data!$R$3:$R$99780,\">=\"&SDate,Data!$R$3:$R$99780,\"<=\"&RDate,Data!$F$3:$F$99780,V95)","v":0},"BAFR",{"$f":"COUNTIFS(Data!$R$3:$R$99780,\">=\"&SDate,Data!$R$3:$R$99780,\"<=\"&RDate,Data!$G$3:$G$99780,X95)","v":0},"OTH",{"$f":"COUNTIFS(Data!$R$3:$R$99780,\">=\"&SDate,Data!$R$3:$R$99780,\"<=\"&RDate,Data!$I$3:$I$99780,Z95)","v":0},null,"Mu",{"$f":"COUNTIFS(Data!$DW$3:$DW$99780,\">=\"&SDate,Data!$DW$3:$DW$99780,\"<=\"&RDate,Data!$E$3:$E$99780,AC95)","v":0},"Na",{"$f":"COUNTIFS(Data!$DW$3:$DW$99780,\">=\"&SDate,Data!$DW$3:$DW$99780,\"<=\"&RDate,Data!$F$3:$F$99780,AE95)","v":0},"BAFR",{"$f":"COUNTIFS(Data!$DW$3:$DW$99780,\">=\"&SDate,Data!$DW$3:$DW$99780,\"<=\"&RDate,Data!$G$3:$G$99780,AG95)","v":0},"OTH",{"$f":"COUNTIFS(Data!$DW$3:$DW$99780,\">=\"&SDate,Data!$DW$3:$DW$99780,\"<=\"&RDate,Data!$I$3:$I$99780,AI95)","v":0}]
["No",{"$f":"COUNTIFS(Data!$DV$3:$DV$99780,TRUE,Data!$E$3:$E$99780,A96)","v":0},"Ot",{"$f":"COUNTIFS(Data!$DV$3:$DV$99780,TRUE,Data!$F$3:$F$99780,C96)","v":0},"BCRB",{"$f":"COUNTIFS(Data!$DV$3:$DV$99780,TRUE,Data!$G$3:$G$99780,E96)","v":0},"REFU",{"$f":"COUNTIFS(Data!$DV$3:$DV$99780,TRUE,Data!$I$3:$I$99780,G96)","v":0},null,null,"No",{"$f":"COUNTIFS(Data!$Q$3:$Q$99780,\">=\"&SDate,Data!$Q$3:$Q$99780,\"<=\"&RDate,Data!$X$3:$X$99780,\"<>3\",Data!$E$3:$E$99780,K96)","v":0},"Ot",{"$f":"COUNTIFS(Data!$Q$3:$Q$99780,\">=\"&SDate,Data!$Q$3:$Q$99780,\"<=\"&RDate,Data!$X$3:$X$99780,\"<>3\",Data!$F$3:$F$99780,M96)","v":0},"BCRB",{"$f":"COUNTIFS(Data!$Q$3:$Q$99780,\">=\"&SDate,Data!$Q$3:$Q$99780,\"<=\"&RDate,Data!$X$3:$X$99780,\"<>3\",Data!$G$3:$G$99780,O96)","v":0},"REFU",{"$f":"COUNTIFS(Data!$Q$3:$Q$99780,\">=\"&SDate,Data!$Q$3:$Q$99780,\"<=\"&RDate,Data!$X$3:$X$99780,\"<>3\",Data!$I$3:$I$99780,Q96)","v":0},null,"No",{"$f":"COUNTIFS(Data!$R$3:$R$99780,\">=\"&SDate,Data!$R$3:$R$99780,\"<=\"&RDate,Data!$E$3:$E$99780,T96)","v":0},"Ot",{"$f":"COUNTIFS(Data!$R$3:$R$99780,\">=\"&SDate,Data!$R$3:$R$99780,\"<=\"&RDate,Data!$F$3:$F$99780,V96)","v":0},"BCRB",{"$f":"COUNTIFS(Data!$R$3:$R$99780,\">=\"&SDate,Data!$R$3:$R$99780,\"<=\"&RDate,Data!$G$3:$G$99780,X96)","v":0},"REFU",{"$f":"COUNTIFS(Data!$R$3:$R$99780,\">=\"&SDate,Data!$R$3:$R$99780,\"<=\"&RDate,Data!$I$3:$I$99780,Z96)","v":0},null,"No",{"$f":"COUNTIFS(Data!$DW$3:$DW$99780,\">=\"&SDate,Data!$DW$3:$DW$99780,\"<=\"&RDate,Data!$E$3:$E$99780,AC96)","v":0},"Ot",{"$f":"COUNTIFS(Data!$DW$3:$DW$99780,\">=\"&SDate,Data!$DW$3:$DW$99780,\"<=\"&RDate,Data!$F$3:$F$99780,AE96)","v":0},"BCRB",{"$f":"COUNTIFS(Data!$DW$3:$DW$99780,\">=\"&SDate,Data!$DW$3:$DW$99780,\"<=\"&RDate,Data!$G$3:$G$99780,AG96)","v":0},"REFU",{"$f":"COUNTIFS(Data!$DW$3:$DW$99780,\">=\"&SDate,Data!$DW$3:$DW$99780,\"<=\"&RDate,Data!$I$3:$I$99780,AI96)","v":0}]
["Ot",{"$f":"COUNTIFS(Data!$DV$3:$DV$99780,TRUE,Data!$E$3:$E$99780,A97)","v":0},"Ot",{"$f":"COUNTIFS(Data!$DV$3:$DV$99780,TRUE,Data!$F$3:$F$99780,C97)","v":0},"BOTH",{"$f":"COUNTIFS(Data!$DV$3:$DV$99780,TRUE,Data!$G$3:$G$99780,E97)","v":0},"SIN",{"$f":"COUNTIFS(Data!$DV$3:$DV$99780,TRUE,Data!$I$3:$I$99780,G97)","v":0},null,null,"Ot",{"$f":"COUNTIFS(Data!$Q$3:$Q$99780,\">=\"&SDate,Data!$Q$3:$Q$99780,\"<=\"&RDate,Data!$X$3:$X$99780,\"<>3\",Data!$E$3:$E$99780,K97)","v":0},"Ot",{"$f":"COUNTIFS(Data!$Q$3:$Q$99780,\">=\"&SDate,Data!$Q$3:$Q$99780,\"<=\"&RDate,Data!$X$3:$X$99780,\"<>3\",Data!$F$3:$F$99780,M97)","v":0},"BOTH",{"$f":"COUNTIFS(Data!$Q$3:$Q$99780,\">=\"&SDate,Data!$Q$3:$Q$99780,\"<=\"&RDate,Data!$X$3:$X$99780,\"<>3\",Data!$G$3:$G$99780,O97)","v":0},"SIN",{"$f":"COUNTIFS(Data!$Q$3:$Q$99780,\">=\"&SDate,Data!$Q$3:$Q$99780,\"<=\"&RDate,Data!$X$3:$X$99780,\"<>3\",Data!$I$3:$I$99780,Q97)","v":0},null,"Ot",{"$f":"COUNTIFS(Data!$R$3:$R$99780,\">=\"&SDate,Data!$R$3:$R$99780,\"<=\"&RDate,Data!$E$3:$E$99780,T97)","v":0},"Ot",{"$f":"COUNTIFS(Data!$R$3:$R$99780,\">=\"&SDate,Data!$R$3:$R$99780,\"<=\"&RDate,Data!$F$3:$F$99780,V97)","v":0},"BOTH",{"$f":"COUNTIFS(Data!$R$3:$R$99780,\">=\"&SDate,Data!$R$3:$R$99780,\"<=\"&RDate,Data!$G$3:$G$99780,X97)","v":0},"SIN",{"$f":"COUNTIFS(Data!$R$3:$R$99780,\">=\"&SDate,Data!$R$3:$R$99780,\"<=\"&RDate,Data!$I$3:$I$99780,Z97)","v":0},null,"Ot",{"$f":"COUNTIFS(Data!$DW$3:$DW$99780,\">=\"&SDate,Data!$DW$3:$DW$99780,\"<=\"&RDate,Data!$E$3:$E$99780,AC97)","v":0},"Ot",{"$f":"COUNTIFS(Data!$DW$3:$DW$99780,\">=\"&SDate,Data!$DW$3:$DW$99780,\"<=\"&RDate,Data!$F$3:$F$99780,AE97)","v":0},"BOTH",{"$f":"COUNTIFS(Data!$DW$3:$DW$99780,\">=\"&SDate,Data!$DW$3:$DW$99780,\"<=\"&RDate,Data!$G$3:$G$99780,AG97)","v":0},"SIN",{"$f":"COUNTIFS(Data!$DW$3:$DW$99780,\">=\"&SDate,Data!$DW$3:$DW$99780,\"<=\"&RDate,Data!$I$3:$I$99780,AI97)","v":0}]
["Re",{"$f":"COUNTIFS(Data!$DV$3:$DV$99780,TRUE,Data!$E$3:$E$99780,A98)","v":0},"Pa",{"$f":"COUNTIFS(Data!$DV$3:$DV$99780,TRUE,Data!$F$3:$F$99780,C98)","v":0},"CHNE",{"$f":"COUNTIFS(Data!$DV$3:$DV$99780,TRUE,Data!$G$3:$G$99780,E98)","v":0},"SSP",{"$f":"COUNTIFS(Data!$DV$3:$DV$99780,TRUE,Data!$I$3:$I$99780,G98)","v":0},null,null,"Re",{"$f":"COUNTIFS(Data!$Q$3:$Q$99780,\">=\"&SDate,Data!$Q$3:$Q$99780,\"<=\"&RDate,Data!$X$3:$X$99780,\"<>3\",Data!$E$3:$E$99780,K98)","v":0},"Pa",{"$f":"COUNTIFS(Data!$Q$3:$Q$99780,\">=\"&SDate,Data!$Q$3:$Q$99780,\"<=\"&RDate,Data!$X$3:$X$99780,\"<>3\",Data!$F$3:$F$99780,M98)","v":0},"CHNE",{"$f":"COUNTIFS(Data!$Q$3:$Q$99780,\">=\"&SDate,Data!$Q$3:$Q$99780,\"<=\"&RDate,Data!$X$3:$X$99780,\"<>3\",Data!$G$3:$G$99780,O98)","v":0},"SSP",{"$f":"COUNTIFS(Data!$Q$3:$Q$99780,\">=\"&SDate,Data!$Q$3:$Q$99780,\"<=\"&RDate,Data!$X$3:$X$99780,\"<>3\",Data!$I$3:$I$99780,Q98)","v":0},null,"Re",{"$f":"COUNTIFS(Data!$R$3:$R$99780,\">=\"&SDate,Data!$R$3:$R$99780,\"<=\"&RDate,Data!$E$3:$E$99780,T98)","v":0},"Pa",{"$f":"COUNTIFS(Data!$R$3:$R$99780,\">=\"&SDate,Data!$R$3:$R$99780,\"<=\"&RDate,Data!$F$3:$F$99780,V98)","v":0},"CHNE",{"$f":"COUNTIFS(Data!$R$3:$R$99780,\">=\"&SDate,Data!$R$3:$R$99780,\"<=\"&RDate,Data!$G$3:$G$99780,X98)","v":0},"SSP",{"$f":"COUNTIFS(Data!$R$3:$R$99780,\">=\"&SDate,Data!$R$3:$R$99780,\"<=\"&RDate,Data!$I$3:$I$99780,Z98)","v":0},null,"Re",{"$f":"COUNTIFS(Data!$DW$3:$DW$99780,\">=\"&SDate,Data!$DW$3:$DW$99780,\"<=\"&RDate,Data!$E$3:$E$99780,AC98)","v":0},"Pa",{"$f":"COUNTIFS(Data!$DW$3:$DW$99780,\">=\"&SDate,Data!$DW$3:$DW$99780,\"<=\"&RDate,Data!$F$3:$F$99780,AE98)","v":0},"CHNE",{"$f":"COUNTIFS(Data!$DW$3:$DW$99780,\">=\"&SDate,Data!$DW$3:$DW$99780,\"<=\"&RDate,Data!$G$3:$G$99780,AG98)","v":0},"SSP",{"$f":"COUNTIFS(Data!$DW$3:$DW$99780,\">=\"&SDate,Data!$DW$3:$DW$99780,\"<=\"&RDate,Data!$I$3:$I$99780,AI98)","v":0}]
["Na",{"$f":"COUNTIFS(Data!$DV$3:$DV$99780,TRUE,Data!$E$3:$E$99780,A99)","v":0},"Po",{"$f":"COUNTIFS(Data!$DV$3:$DV$99780,TRUE,Data!$F$3:$F$99780,C99)","v":0},"MOTH",{"$f":"COUNTIFS(Data!$DV$3:$DV$99780,TRUE,Data!$G$3:$G$99780,E99)","v":0},null,null,null,null,"Na",{"$f":"COUNTIFS(Data!$Q$3:$Q$99780,\">=\"&SDate,Data!$Q$3:$Q$99780,\"<=\"&RDate,Data!$X$3:$X$99780,\"<>3\",Data!$E$3:$E$99780,K99)","v":0},"Po",{"$f":"COUNTIFS(Data!$Q$3:$Q$99780,\">=\"&SDate,Data!$Q$3:$Q$99780,\"<=\"&RDate,Data!$X$3:$X$99780,\"<>3\",Data!$F$3:$F$99780,M99)","v":0},"MOTH",{"$f":"COUNTIFS(Data!$Q$3:$Q$99780,\">=\"&SDate,Data!$Q$3:$Q$99780,\"<=\"&RDate,Data!$X$3:$X$99780,\"<>3\",Data!$G$3:$G$99780,O99)","v":0},null,null,null,"Na",{"$f":"COUNTIFS(Data!$R$3:$R$99780,\">=\"&SDate,Data!$R$3:$R$99780,\"<=\"&RDate,Data!$E$3:$E$99780,T99)","v":0},"Po",{"$f":"COUNTIFS(Data!$R$3:$R$99780,\">=\"&SDate,Data!$R$3:$R$99780,\"<=\"&RDate,Data!$F$3:$F$99780,V99)","v":0},"MOTH",{"$f":"COUNTIFS(Data!$R$3:$R$99780,\">=\"&SDate,Data!$R$3:$R$99780,\"<=\"&RDate,Data!$G$3:$G$99780,X99)","v":0},null,null,null,"Na",{"$f":"COUNTIFS(Data!$DW$3:$DW$99780,\">=\"&SDate,Data!$DW$3:$DW$99780,\"<=\"&RDate,Data!$E$3:$E$99780,AC99)","v":0},"Po",{"$f":"COUNTIFS(Data!$DW$3:$DW$99780,\">=\"&SDate,Data!$DW$3:$DW$99780,\"<=\"&RDate,Data!$F$3:$F$99780,AE99)","v":0},"MOTH",{"$f":"COUNTIFS(Data!$DW$3:$DW$99780,\">=\"&SDate,Data!$DW$3:$DW$99780,\"<=\"&RDate,Data!$G$3:$G$99780,AG99)","v":0}]
[null,null,"Qu",{"$f":"COUNTIFS(Data!$DV$3:$DV$99780,TRUE,Data!$F$3:$F$99780,C100)","v":0},"MWAS",{"$f":"COUNTIFS(Data!$DV$3:$DV$99780,TRUE,Data!$G$3:$G$99780,E100)","v":0},null,null,null,null,null,null,"Qu",{"$f":"COUNTIFS(Data!$Q$3:$Q$99780,\">=\"&SDate,Data!$Q$3:$Q$99780,\"<=\"&RDate,Data!$X$3:$X$99780,\"<>3\",Data!$F$3:$F$99780,M100)","v":0},"MWAS",{"$f":"COUNTIFS(Data!$Q$3:$Q$99780,\">=\"&SDate,Data!$Q$3:$Q$99780,\"<=\"&RDate,Data!$X$3:$X$99780,\"<>3\",Data!$G$3:$G$99780,O100)","v":0},null,null,null,null,null,"Qu",{"$f":"COUNTIFS(Data!$R$3:$R$99780,\">=\"&SDate,Data!$R$3:$R$99780,\"<=\"&RDate,Data!$F$3:$F$99780,V100)","v":0},"MWAS",{"$f":"COUNTIFS(Data!$R$3:$R$99780,\">=\"&SDate,Data!$R$3:$R$99780,\"<=\"&RDate,Data!$G$3:$G$99780,X100)","v":0},null,null,null,null,null,"Qu",{"$f":"COUNTIFS(Data!$DW$3:$DW$99780,\">=\"&SDate,Data!$DW$3:$DW$99780,\"<=\"&RDate,Data!$F$3:$F$99780,AE100)","v":0},"MWAS",{"$f":"COUNTIFS(Data!$DW$3:$DW$99780,\">=\"&SDate,Data!$DW$3:$DW$99780,\"<=\"&RDate,Data!$G$3:$G$99780,AG100)","v":0}]
[null,null,"Re",{"$f":"COUNTIFS(Data!$DV$3:$DV$99780,TRUE,Data!$F$3:$F$99780,C101)","v":0},"MWBA",{"$f":"COUNTIFS(Data!$DV$3:$DV$99780,TRUE,Data!$G$3:$G$99780,E101)","v":0},null,null,null,null,null,null,"Re",{"$f":"COUNTIFS(Data!$Q$3:$Q$99780,\">=\"&SDate,Data!$Q$3:$Q$99780,\"<=\"&RDate,Data!$X$3:$X$99780,\"<>3\",Data!$F$3:$F$99780,M101)","v":0},"MWBA",{"$f":"COUNTIFS(Data!$Q$3:$Q$99780,\">=\"&SDate,Data!$Q$3:$Q$99780,\"<=\"&RDate,Data!$X$3:$X$99780,\"<>3\",Data!$G$3:$G$99780,O101)","v":0},null,null,null,null,null,"Re",{"$f":"COUNTIFS(Data!$R$3:$R$99780,\">=\"&SDate,Data!$R$3:$R$99780,\"<=\"&RDate,Data!$F$3:$F$99780,V101)","v":0},"MWBA",{"$f":"COUNTIFS(Data!$R$3:$R$99780,\">=\"&SDate,Data!$R$3:$R$99780,\"<=\"&RDate,Data!$G$3:$G$99780,X101)","v":0},null,null,null,null,null,"Re",{"$f":"COUNTIFS(Data!$DW$3:$DW$99780,\">=\"&SDate,Data!$DW$3:$DW$99780,\"<=\"&RDate,Data!$F$3:$F$99780,AE101)","v":0},"MWBA",{"$f":"COUNTIFS(Data!$DW$3:$DW$99780,\">=\"&SDate,Data!$DW$3:$DW$99780,\"<=\"&RDate,Data!$G$3:$G$99780,AG101)","v":0}]
[null,null,null,null,"MWBC",{"$f":"COUNTIFS(Data!$DV$3:$DV$99780,TRUE,Data!$G$3:$G$99780,E102)","v":0},null,null,null,null,null,null,null,null,"MWBC",{"$f":"COUNTIFS(Data!$Q$3:$Q$99780,\">=\"&SDate,Data!$Q$3:$Q$99780,\"<=\"&RDate,Data!$X$3:$X$99780,\"<>3\",Data!$G$3:$G$99780,O102)","v":0},null,null,null,null,null,null,null,"MWBC",{"$f":"COUNTIFS(Data!$R$3:$R$99780,\">=\"&SDate,Data!$R$3:$R$99780,\"<=\"&RDate,Data!$G$3:$G$99780,X102)","v":0},null,null,null,null,null,null,null,"MWBC",{"$f":"COUNTIFS(Data!$DW$3:$DW$99780,\">=\"&SDate,Data!$DW$3:$DW$99780,\"<=\"&RDate,Data!$G$3:$G$99780,AG102)","v":0}]
[null,null,null,null,"NOBT",{"$f":"COUNTIFS(Data!$DV$3:$DV$99780,TRUE,Data!$G$3:$G$99780,E103)","v":0},null,null,null,null,null,null,null,null,"NOBT",{"$f":"COUNTIFS(Data!$Q$3:$Q$99780,\">=\"&SDate,Data!$Q$3:$Q$99780,\"<=\"&RDate,Data!$X$3:$X$99780,\"<>3\",Data!$G$3:$G$99780,O103)","v":0},null,null,null,null,null,null,null,"NOBT",{"$f":"COUNTIFS(Data!$R$3:$R$99780,\">=\"&SDate,Data!$R$3:$R$99780,\"<=\"&RDate,Data!$G$3:$G$99780,X103)","v":0},null,null,null,null,null,null,null,"NOBT",{"$f":"COUNTIFS(Data!$DW$3:$DW$99780,\">=\"&SDate,Data!$DW$3:$DW$99780,\"<=\"&RDate,Data!$G$3:$G$99780,AG103)","v":0}]
[null,null,null,null,"OOTH",{"$f":"COUNTIFS(Data!$DV$3:$DV$99780,TRUE,Data!$G$3:$G$99780,E104)","v":0},null,null,null,null,null,null,null,null,"OOTH",{"$f":"COUNTIFS(Data!$Q$3:$Q$99780,\">=\"&SDate,Data!$Q$3:$Q$99780,\"<=\"&RDate,Data!$X$3:$X$99780,\"<>3\",Data!$G$3:$G$99780,O104)","v":0},null,null,null,null,null,null,null,"OOTH",{"$f":"COUNTIFS(Data!$R$3:$R$99780,\">=\"&SDate,Data!$R$3:$R$99780,\"<=\"&RDate,Data!$G$3:$G$99780,X104)","v":0},null,null,null,null,null,null,null,"OOTH",{"$f":"COUNTIFS(Data!$DW$3:$DW$99780,\">=\"&SDate,Data!$DW$3:$DW$99780,\"<=\"&RDate,Data!$G$3:$G$99780,AG104)","v":0}]
[null,null,null,null,"REFU",{"$f":"COUNTIFS(Data!$DV$3:$DV$99780,TRUE,Data!$G$3:$G$99780,E105)","v":0},null,null,null,null,null,null,null,null,"REFU",{"$f":"COUNTIFS(Data!$Q$3:$Q$99780,\">=\"&SDate,Data!$Q$3:$Q$99780,\"<=\"&RDate,Data!$X$3:$X$99780,\"<>3\",Data!$G$3:$G$99780,O105)","v":0},null,null,null,null,null,null,null,"REFU",{"$f":"COUNTIFS(Data!$R$3:$R$99780,\">=\"&SDate,Data!$R$3:$R$99780,\"<=\"&RDate,Data!$G$3:$G$99780,X105)","v":0},null,null,null,null,null,null,null,"REFU",{"$f":"COUNTIFS(Data!$DW$3:$DW$99780,\">=\"&SDate,Data!$DW$3:$DW$99780,\"<=\"&RDate,Data!$G$3:$G$99780,AG105)","v":0}]
[null,null,null,null,"WBRI",{"$f":"COUNTIFS(Data!$DV$3:$DV$99780,TRUE,Data!$G$3:$G$99780,E106)","v":0},null,null,null,null,null,null,null,null,"WBRI",{"$f":"COUNTIFS(Data!$Q$3:$Q$99780,\">=\"&SDate,Data!$Q$3:$Q$99780,\"<=\"&RDate,Data!$X$3:$X$99780,\"<>3\",Data!$G$3:$G$99780,O106)","v":0},null,null,null,null,null,null,null,"WBRI",{"$f":"COUNTIFS(Data!$R$3:$R$99780,\">=\"&SDate,Data!$R$3:$R$99780,\"<=\"&RDate,Data!$G$3:$G$99780,X106)","v":0},null,null,null,null,null,null,null,"WBRI",{"$f":"COUNTIFS(Data!$DW$3:$DW$99780,\">=\"&SDate,Data!$DW$3:$DW$99780,\"<=\"&RDate,Data!$G$3:$G$99780,AG106)","v":0}]
[null,null,null,null,"WIRI",{"$f":"COUNTIFS(Data!$DV$3:$DV$99780,TRUE,Data!$G$3:$G$99780,E107)","v":0},null,null,null,null,null,null,null,null,"WIRI",{"$f":"COUNTIFS(Data!$Q$3:$Q$99780,\">=\"&SDate,Data!$Q$3:$Q$99780,\"<=\"&RDate,Data!$X$3:$X$99780,\"<>3\",Data!$G$3:$G$99780,O107)","v":0},null,null,null,null,null,null,null,"WIRI",{"$f":"COUNTIFS(Data!$R$3:$R$99780,\">=\"&SDate,Data!$R$3:$R$99780,\"<=\"&RDate,Data!$G$3:$G$99780,X107)","v":0},null,null,null,null,null,null,null,"WIRI",{"$f":"COUNTIFS(Data!$DW$3:$DW$99780,\">=\"&SDate,Data!$DW$3:$DW$99780,\"<=\"&RDate,Data!$G$3:$G$99780,AG107)","v":0}]
[null,null,null,null,"WIRT",{"$f":"COUNTIFS(Data!$DV$3:$DV$99780,TRUE,Data!$G$3:$G$99780,E108)","v":0},null,null,null,null,null,null,null,null,"WIRT",{"$f":"COUNTIFS(Data!$Q$3:$Q$99780,\">=\"&SDate,Data!$Q$3:$Q$99780,\"<=\"&RDate,Data!$X$3:$X$99780,\"<>3\",Data!$G$3:$G$99780,O108)","v":0},null,null,null,null,null,null,null,"WIRT",{"$f":"COUNTIFS(Data!$R$3:$R$99780,\">=\"&SDate,Data!$R$3:$R$99780,\"<=\"&RDate,Data!$G$3:$G$99780,X108)","v":0},null,null,null,null,null,null,null,"WIRT",{"$f":"COUNTIFS(Data!$DW$3:$DW$99780,\">=\"&SDate,Data!$DW$3:$DW$99780,\"<=\"&RDate,Data!$G$3:$G$99780,AG108)","v":0}]
[null,null,null,null,"WOTH",{"$f":"COUNTIFS(Data!$DV$3:$DV$99780,TRUE,Data!$G$3:$G$99780,E109)","v":0},null,null,null,null,null,null,null,null,"WOTH",{"$f":"COUNTIFS(Data!$Q$3:$Q$99780,\">=\"&SDate,Data!$Q$3:$Q$99780,\"<=\"&RDate,Data!$X$3:$X$99780,\"<>3\",Data!$G$3:$G$99780,O109)","v":0},null,null,null,null,null,null,null,"WOTH",{"$f":"COUNTIFS(Data!$R$3:$R$99780,\">=\"&SDate,Data!$R$3:$R$99780,\"<=\"&RDate,Data!$G$3:$G$99780,X109)","v":0},null,null,null,null,null,null,null,"WOTH",{"$f":"COUNTIFS(Data!$DW$3:$DW$99780,\">=\"&SDate,Data!$DW$3:$DW$99780,\"<=\"&RDate,Data!$G$3:$G$99780,AG109)","v":0}]
[null,null,null,null,"WROM",{"$f":"COUNTIFS(Data!$DV$3:$DV$99780,TRUE,Data!$G$3:$G$99780,E110)","v":0},null,null,null,null,null,null,null,null,"WROM",{"$f":"COUNTIFS(Data!$Q$3:$Q$99780,\">=\"&SDate,Data!$Q$3:$Q$99780,\"<=\"&RDate,Data!$X$3:$X$99780,\"<>3\",Data!$G$3:$G$99780,O110)","v":0},null,null,null,null,null,null,null,"WROM",{"$f":"COUNTIFS(Data!$R$3:$R$99780,\">=\"&SDate,Data!$R$3:$R$99780,\"<=\"&RDate,Data!$G$3:$G$99780,X110)","v":0},null,null,null,null,null,null,null,"WROM",{"$f":"COUNTIFS(Data!$DW$3:$DW$99780,\">=\"&SDate,Data!$DW$3:$DW$99780,\"<=\"&RDate,Data!$G$3:$G$99780,AG110)","v":0}]

{"sheet":"Checks","index":8,"n_rows":86,"n_cols":3,"rows_kept":86,"cut":false,"hidden":false,"merged":[]}
["This is a full list of the data checks this tool performs. If any checks are incorrect or missing please let us know."]
[]
["Check ID","Description","Formula"]
["A3 (i)","Checks that the right number of adults are sharing an application ID","=IF(OR(AND(COUNTIF(B$1:B$50000,B3)<>1,I3=\"SIN\"),AND(COUNTIF(B$1:B$50000,B3)<>2,I3<>\"NOBT\",I3<>\"OTH\",I3<>\"SIN\",I3<>\"REFU\")),\"The wrong number of adopters have been allocated this Application ID.\",\"\")"]
["A3 (ii)","Checks that an application ID is entered","=IF(B3=\"\",\"Application ID must be completed.\",\"\")"]
["A4 (i)","Checks if a valid code has been entered under Gender","=IF(AND(C3<>\"\",OR(C3=0,C3=1,C3=2,C3=3,C3=4,C3=5,C3=6,C3=7,C3=8,C3=9)),\"\",\"Gender (A4) code must be entered and can only be 0, 1, 2,3,4,5,6,7,8 or 9\")"]
["A4 (ii)","Checks the same gender has been entered for same-sex partners and different genders have been entered for male/female partnerships","=IF(AND(COUNTIF(B$1:B$50000,B3)=2,AE3=TRUE),IF(AND(I3=\"SSP\",OR(AND(OR(C3=2,C3=5),OR(VLOOKUP(B3,B$1:AA$50000,AJ$1-1,FALSE)=1,VLOOKUP(B3,B$1:AA$50000,AJ$1-1,FALSE)=4)),AND(OR(C3=1,C3=4),OR(VLOOKUP(B3,B$1:AA$50000,AJ$1-1,FALSE)=2,VLOOKUP(B3,B$1:AA$50000,AJ$1-1,FALSE)=5)))),\"The same gender has to be entered for couples in a same-sex partnership (SSP)\",IF(AND(I3=\"CLM\",OR(AND(OR(C3=1,C3=4),OR(VLOOKUP(B3,B$1:AA$50000,AJ$1-1,FALSE)=1,VLOOKUP(B3,B$1:AA$50000,AJ$1-1,FALSE)=4)),AND(OR(C3=2,C3=5),OR(VLOOKUP(B3,B$1:AA$50000,AJ$1-1,FALSE)=2,VLOOKUP(B3,B$1:AA$50000,AJ$1-1,FALSE)=5)))),\"Different genders have to be entered for couples in a male/female partnership (CLM).\",\"\")),\"\")"]
["A5 (i)","Checks that what has been entered under A5 is a (suitable) date","=IF(OR(D3=\"\",OR(ISNUMBER(D3)=FALSE,AND(ISNUMBER(D3)=TRUE,M3<>\"\",EDATE(D3,12*21)>M3))),\"Only suitable dates should be recorded here\",\"\")"]
["A6 (i)","Checks if a valid code has been entered under Religion","=IF(ISNA(MATCH(E3,Glossary!B$15:B$23,0)),\"Invalid code entered for Religion.\",\"\")"]
["A7 (i)","Checks if a valid code has been entered under Sexual Orientation","=IF(ISNA(MATCH(F3,Lists!G$2:G$11,0)),\"Invalid code entered for Sexual orientation.\",\"\")"]
["A8 (i)","Checks if a valid code has been entered under Ethnicity","=IF(ISNA(MATCH(G3,Lists!A$2:A$21,0)),\"Invalid code entered for Ethnicity.\",\"\")"]
["A9 (i)","Checks if a valid code has been entered under Disability","=IF(AND(H3<>\"\",OR(H3=0,H3=1)),\"\",\"Disability (A9) code can only be 0 or 1\")"]
["A10 (i)","Checks if a valid code has been entered under Relationship Status","=IF(ISNA(MATCH(I3,Lists!J$2:J$9,0)),\"Invalid code entered for Relationship status.\",\"\")"]
["A10 (ii)","Checks that the same relationship status is recorded for both adults sharing an application ID","=IF(AND(COUNTIF(B$1:B$50000,B3)=2,AE3=TRUE),IF(I3<>VLOOKUP(B3,B$1:AA$50000,AQ$1-1,FALSE),\"The relationship status should be the same for both adults under this application.\",\"\"),\"\")"]
["A11 (i)","Checks that a 0 or 1 is entered","=IF(OR(J3=0,J3=1),\"\",\"A11 code can only be 0 (No) or 1 (Yes).\")"]
["A11 (ii)","Checks that the same foster carer code is recorded for both adults sharing an application ID","=IF(AND(COUNTIF(B$1:B$50000,B3)=2,AE3=TRUE),IF(J3<>VLOOKUP(B3,B$1:AA$50000,AS$1-1,FALSE),\"The foster carer flag should be the same for both adults under this application.\",\"\"),\"\")"]
["A11 (iii)","Checks that adopters are not flagged as both foster carer and FFA carer - they can only be one of these","=IF(AND(J3=1,K3=1),\"A carer should only be flagged as EITHER a foster carer or FFA carer, and not both\",\"\")"]
["A12 (i)","Checks that a 0, 1 or 2 is entered","=IF(OR(K3=0,K3=1,K3=2),\"\",\"A12 code can only be 0 (No), 1 (Yes: Child placed) or 2 (Yes: No child placed yet).\")"]
["A12 (ii)","Checks that the same FFA code is recorded for both adults sharing an application ID","=IF(AND(COUNTIF(B$1:B$50000,B3)=2,AE3=TRUE),IF(K3<>VLOOKUP(B3,B$1:AA$50000,AV$1-1,FALSE),\"The FFA flag should be the same for both adults under this application.\",\"\"),\"\")"]
["A13b (i)","Checks if a URN code has been entered","=IF(ISNUMBER(L3),IF(AND(ISNA(MATCH(L3*1,URN!$A$2:$A$500,0)),ISNA(MATCH(L3*1,URN!$B$2:$B$500,0)),L3<>\"\"),\"Unrecognised URN entered for A13b.\",\"\"),IF(AND(ISNA(MATCH(L3,URN!$A$2:$A$500,0)),ISNA(MATCH(L3,URN!$B$2:$B$500,0)),L3<>\"\"),\"Unrecognised URN entered for A13b.\",\"\"))"]
["A13b (ii)","Checks if a URN code is missing when a child has been placed for adoption","=IF(AND(OR(S3<>\"\",U3<>\"\"),L3=\"\"),\"The URN for the child's LA is missing.\",\"\")"]
["A13b (iii)","Checks that the same URN code is recorded for both adults sharing an application ID","=IF(AND(COUNTIF(B$1:B$50000,B3)=2,AE3=TRUE),IF(L3<>VLOOKUP(B3,B$1:AA$50000,AY$1-1,FALSE),\"The URN code should be the same for both adults under this application.\",\"\"),\"\")"]
["B1 (i)","Checks that an enquiry date is recorded for all adults","=IF(M3=\"\",\"Enquiry date (B1) must be completed.\",\"\")"]
["B1 (ii)","Checks that the same enquiry date is recorded for both adults sharing an application ID","=IF(AND(COUNTIF(B$1:B$50000,B3)=2,AE3=TRUE),IF(M3<>VLOOKUP(B3,B$1:AA$50000,BA$1-1,FALSE),\"The enquiry date should be the same for both adults under this application.\",\"\"),\"\")"]
["B1 (iii)","Checks that what has been entered under B1 is a (suitable) date","=IF(AND(M3<>\"\",OR(ISNUMBER(M3)=FALSE,AND(ISNUMBER(M3)=TRUE,OR(M3>Rdate,M3<D3)))),\"Only suitable dates should be recorded here\",\"\")"]
["B1 (iv)","Checks whether the adopter has only made an enquiry to adopt and should be removed from the return","=IF(COUNTBLANK(N3:U3)=8,\"Has this adopter only made an enquiry to adopt? If so, then please delete this record as we only collect data on adopters who have made a successful application.\",\"\")"]
["B2 (i)","If adopters are not foster carers or repeat adopters we would not expect an assessment to be fast-tracked, so if Stage 1 dates are missing in such cases we query this","=IF(AND(N3=\"\",AA3<>1),\"Stage 1 start date (B2) must be completed if case is not fast-tracked.\",\"\")"]
["B2 (ii)","If adopters are foster carers or repeat adopters we would expect an assessment to be fast-tracked, so if Stage 1 dates are recorded in such cases we query this","=IF(AND(OR(O3<>\"\",N3<>\"\"),AA3=1),\"Please do not record any dates under B2 if case was fast-tracked.\",\"\")"]
["B2 (iii)","Stage 1 cannot start before the initial enquiry was made","=IF(AND(M3<>\"\",N3<>\"\",M3>N3),\"Stage 1 start date cannot be before the enquiry date (B1).\",\"\")"]
["B2 (iv)","Checks that the same Stage 1 start date is recorded for both adults sharing an application ID","=IF(AND(COUNTIF(B$1:B$50000,B3)=2,AE3=TRUE),IF(N3<>VLOOKUP(B3,B$1:AA$50000,BG$1-1,FALSE),\"The Stage 1 start date should be the same for both adults under this application.\",\"\"),\"\")"]
["B2 (v)","Checks that what has been entered under B2 is a (suitable) date","=IF(AND(N3<>\"\",OR(ISNUMBER(N3)=FALSE,AND(ISNUMBER(N3)=TRUE,OR(N3>Rdate,N3<M3)))),\"Only suitable dates should be recorded here\",\"\")"]
["B3 (i)","Stage 1 cannot end before it started","=IF(AND(N3<>\"\",O3<>\"\",N3>O3),\"Stage 1 end date must be after Stage 1 start date (B2).\",\"\")"]
["B3 (ii)","Checks if there is no Stage 1 end date but the case has started Stage 1 and has progressed to Stage 2 OR the case was not fast-tracked, has no Stage 1 start date and has progressed to Stage 2","=IF(AND(OR(N3<>\"\",AND(N3=\"\",AA3<>1)),O3=\"\",OR(P3<>\"\",Q3<>\"\",R3<>\"\",S3<>\"\",U3<>\"\")),\"Stage 1 end date is missing.\",\"\")"]
["B3 (iii)","If adopters are foster carers or repeat adopters we would expect an assessment to be fast-tracked, so if Stage 1 dates are recorded in such cases we query this","=IF(AND(OR(O3<>\"\",N3<>\"\"),AA3=1),\"Please do not record any dates under B3 if case was fast-tracked.\",\"\")"]
["B3 (iv)","Checks if the timescale for Stage 1 looks unrealistically short (less than 2 weeks)","=IF(AND(N3<>\"\",O3<>\"\",O3-N3<14),\"The data indicates Stage 1 lasted less than a fortnight. Is this correct? If not please enter correct dates\",\"\")"]
["B3 (v)","Checks that the same Stage 1 end date is recorded for both adults sharing an application ID","=IF(AND(COUNTIF(B$1:B$50000,B3)=2,AE3=TRUE),IF(O3<>VLOOKUP(B3,B$1:AA$50000,BM$1-1,FALSE),\"The Stage 1 end date should be the same for both adults under this application.\",\"\"),\"\")"]
["B3 (vi)","Checks that what has been entered under B3 is a (suitable) date","=IF(AND(O3<>\"\",OR(ISNUMBER(O3)=FALSE,AND(ISNUMBER(O3)=TRUE,OR(O3>Rdate,O3<N3)))),\"Only suitable dates should be recorded here\",\"\")"]
["B4 (i)","Checks if there is no Stage 2 start date but the case has progressed past Stage 2","=IF(AND(P3=\"\",OR(Q3<>\"\",AND(OR(N3<>\"\",O3<>\"\"),OR(R3<>\"\",S3<>\"\",U3<>\"\")))),\"Stage 2 start date is missing.\",\"\")"]
["B4 (ii)","Stage 2 cannot end before it started","=IF(AND(P3<>\"\",Q3<>\"\",P3>Q3),\"Stage 2 start date must be before Stage 2 end date (B5).\",\"\")"]
["B4 (iii)","Checks that the same Stage 2 start date is recorded for both adults sharing an application ID","=IF(AND(COUNTIF(B$1:B$50000,B3)=2,AE3=TRUE),IF(P3<>VLOOKUP(B3,B$1:AA$50000,BQ$1-1,FALSE),\"The Stage 2 start date should be the same for both adults under this application.\",\"\"),\"\")"]
["B4 (iv)","Checks that what has been entered under B4 is a (suitable) date","=IF(AND(P3<>\"\",OR(ISNUMBER(P3)=FALSE,AND(ISNUMBER(P3)=TRUE,OR(P3>Rdate,P3<M3)))),\"Only suitable dates should be recorded here\",\"\")"]
["B5 (i)","Checks if there is no Stage 2 end date but the case has progressed past Stage 2","=IF(AND(Q3=\"\",AND(OR(N3<>\"\",O3<>\"\",P3<>\"\"),OR(R3<>\"\",S3<>\"\",U3<>\"\"))),\"Stage 2 end date is missing.\",\"\")"]
["B5 (ii)","Adopters cannot be matched with a child before they are approved","=IF(AND(Q3<>\"\",R3<>\"\",Q3>R3),\"Stage 2 end date cannot be after match date (B8).\",\"\")"]
["B5 (iii)","Checks if the timescale for Stage 2 looks unrealistically short (less than a month)","=IF(AND(P3<>\"\",Q3<>\"\",Q3-P3<30),\"The data indicates Stage 2 lasted less than a month. Is this correct? If not please enter the correct dates\",\"\")"]
["B5 (iv)","Checks that the same Stage 2 end date is recorded for both adults sharing an application ID","=IF(AND(COUNTIF(B$1:B$50000,B3)=2,AE3=TRUE),IF(Q3<>VLOOKUP(B3,B$1:AA$50000,BV$1-1,FALSE),\"The Stage 2 end date should be the same for both adults under this application.\",\"\"),\"\")"]
["B5 (v)","Checks that what has been entered under B5 is a (suitable) date","=IF(AND(Q3<>\"\",OR(ISNUMBER(Q3)=FALSE,AND(ISNUMBER(Q3)=TRUE,OR(Q3>Rdate,Q3<P3)))),\"Only suitable dates should be recorded here\",\"\")"]
["B5 (vi)","Checks if this adopter has had a match, placement or withdrawal within a year of them being approved","=IF(AND(Q3<>\"\",R3=\"\",S3=\"\",W3=\"\",U3=\"\",EDATE(Q3,12)<=RDate,K3<>1),\"This adopter has not had a match, placement or withdrawal within 1 year of their approval, please check that this adopter's record is up-to-date\",\"\")"]
["B8 (i)","Child cannot be placed for adoption before the adoptive match is approved","=IF(AND(R3<>\"\",S3<>\"\",R3>S3),\"Match date cannot be after placement date (B9).\",\"\")"]
["B8 (ii)","Checks if there is no date for the approval of the adoptive match by the ADM but a child has been placed for adoption","=IF(AND(R3=\"\",OR(S3<>\"\",U3<>\"\")),\"Match date is missing.\",\"\")"]
["B8 (iii)","If a child is adopted by their FFA/CP/foster carer, the date of adoptive placement should be the same as the date the ADM approved the adoptive match since the child is already living with the family","=IF(AND(OR(J3=1,K3=1),R3<>\"\",S3<>\"\",R3<>S3),\"If children are adopted by their FFA/foster carer the date of placement (B9) should be the same as the date the adoptive match was approved.\",\"\")"]
["B8 (iv)","Checks that the same match approval date is recorded for both adults sharing an application ID","=IF(AND(COUNTIF(B$1:B$50000,B3)=2,AE3=TRUE),IF(R3<>VLOOKUP(B3,B$1:AA$50000,CB$1-1,FALSE),\"The match date should be the same for both adults under this application.\",\"\"),\"\")"]
["B8 (v)","Checks that what has been entered under B8 is a (suitable) date","=IF(AND(R3<>\"\",OR(ISNUMBER(R3)=FALSE,AND(ISNUMBER(R3)=TRUE,OR(R3>Rdate,R3<Q3)))),\"Only suitable dates should be recorded here\",\"\")"]
["B9 (i)","Adoption Order cannot be granted before a child is placed for adoption","=IF(AND(S3<>\"\",U3<>\"\",S3>U3),\"Placement date cannot be after AO date (B11).\",\"\")"]
["B9 (ii)","Checks if there is no date for the adoptive placement but a child has been adopted or a disruption date is given","=IF(AND(S3=\"\",OR(U3<>\"\",Y3<>\"\",T3>0)),\"Placement date is missing.\",\"\")"]
["B9 (iii)","Checks that the same placement date is recorded for both adults sharing an application ID","=IF(AND(COUNTIF(B$1:B$50000,B3)=2,AE3=TRUE),IF(S3<>VLOOKUP(B3,B$1:AA$50000,CF$1-1,FALSE),\"The placement date should be the same for both adults under this application.\",\"\"),\"\")"]
["B9 (iv)","Checks that what has been entered under B9 is a (suitable) date","=IF(AND(S3<>\"\",OR(ISNUMBER(S3)=FALSE,AND(ISNUMBER(S3)=TRUE,OR(S3>Rdate,S3<R3)))),\"Only suitable dates should be recorded here\",\"\")"]
["B10 (i)","There is no value recorded for the number of children placed despite the data showing that a child has been placed with the adopters","=IF(AND(S3<>\"\",T3<=0),\"Value under B10 is missing.\",\"\")"]
["B10 (ii)","Checks that the same figure is recorded under number of children placed for both adults sharing an application ID","=IF(AND(COUNTIF(B$1:B$50000,B3)=2,AE3=TRUE),IF(T3<>VLOOKUP(B3,B$1:AA$50000,CI$1-1,FALSE),\"The number of children placed should be the same for both adults under this application.\",\"\"),\"\")"]
["B10 (iii)","No value should be recorded if no children have been placed with the adopter","=IF(AND(S3=\"\",T3<>\"\"),\"B10 should be blank if no children are placed with this adopter.\",\"\")"]
["B11 (i)","Checks if an Adoption Order date is missing","=IF(AND(S3<>\"\",OR(Y3=\"\",S3>Y3),AC3=TRUE,U3=\"\"),\"AO date appears to be missing.\",\"\")"]
["B11 (ii)","Checks if the timescale for the Adoption Order looks unrealistically short (less than ten weeks when not adopted by FFA/foster carer)","=IF(AND(J3<>1,K3<>1,S3<>\"\",U3<>\"\",U3-S3<70),\"The child does not appear to have been adopted by a FFA/foster carer so we would not expect the AO to be granted less than 10 weeks after placement.\",\"\")"]
["B11 (iii)","Checks that the same Adoption Order date is recorded for both adults sharing an application ID","=IF(AND(COUNTIF(B$1:B$50000,B3)=2,AE3=TRUE),IF(U3<>VLOOKUP(B3,B$1:AA$50000,CM$1-1,FALSE),\"The date of Adoption Order should be the same for both adults under this application.\",\"\"),\"\")"]
["B11 (iv)","Checks that what has been entered under B11 is a (suitable) date","=IF(AND(U3<>\"\",OR(ISNUMBER(U3)=FALSE,AND(ISNUMBER(U3)=TRUE,OR(U3>Rdate,U3<S3)))),\"Only suitable dates should be recorded here\",\"\")"]
["B11 (v)","Checks if an Adoption Order date has been provided for an adopter who has left the adoption process","=IF(AND(U3<>\"\",OR(X3=1,X3=3)),\"Either the adopter has adopted (keep B11; clear C2a & C2b) or the adopter has left the adoption process by withdrawing / refusal of application (keep C2a & C2b; clear B11)\",\"\")"]
["C1 (i)","Checks that a 0 or 1 is entered","=IF(OR(V3=0,V3=1),\"\",\"C1 entry is invalid - must be 0 (No) or 1 (Yes).\")"]
["C1 (ii)","Checks that the same code is recorded for both adults sharing an application ID","=IF(AND(COUNTIF(B$1:B$50000,B3)=2,AE3=TRUE),IF(V3<>VLOOKUP(B3,B$1:AA$50000,CQ$1-1,FALSE),\"The previously adopted flag should be the same for both adults under this application.\",\"\"),\"\")"]
["C2a (i)","It looks like the adopter has paused or left the process but no date is recorded","=IF(AND(W3=\"\",OR(AC3=TRUE,X3<>\"\",Z3<>\"\")),\"C2a date appears to be missing.\",\"\")"]
["C2a (ii)","If the adopter has left the process this date cannot be before any other dates recorded","=IF(AND(W3<>\"\",X3<>2,W3<MIN(M3:V3)),\"C2a date cannot be before any other dates in this journey.\",\"\")"]
["C2a (iii)","Checks that the same date is recorded for both adults sharing an application ID","=IF(AND(COUNTIF(B$1:B$50000,B3)=2,AE3=TRUE),IF(W3<>VLOOKUP(B3,B$1:AA$50000,CT$1-1,FALSE),\"The C2a date should be the same for both adults under this application.\",\"\"),\"\")"]
["C2a (iv)","Checks that what has been entered under C2a is a (suitable) date","=IF(AND(W3<>\"\",OR(ISNUMBER(W3)=FALSE,AND(ISNUMBER(W3)=TRUE,OR(W3>Rdate,W3<M3)))),\"Only suitable dates should be recorded here\",\"\")"]
["C2b (i)","If the adopter has paused or left the process the relevant code must be entered","=IF(AND(X3=\"\",OR(AC3=TRUE,W3<>\"\",Z3<>\"\")),\"C2b code appears to be missing.\",\"\")"]
["C2b (ii)","Checks that the same code is recorded for both adults sharing an application ID","=IF(AND(COUNTIF(B$1:B$50000,B3)=2,AE3=TRUE),IF(X3<>VLOOKUP(B3,B$1:AA$50000,CW$1-1,FALSE),\"The reason code should be the same for both adults under this application.\",\"\"),\"\")"]
["C3 (i)","If a disruption date is recorded it must be after the date of adoptive placement as the disruption will correspond with that placement","=IF(AND(Y3<>\"\",S3<>\"\",S3>Y3),\"Disruption date must be after placement date (B9).\",\"\")"]
["C3 (ii)","It looks like a placement disrupted but no disruption date is recorded - there was a placement and the adopter have since left the process","=IF(AND(S3<>\"\",U3=\"\",W3<>\"\",Y3=\"\",X3<>2),\"Disruption date appears to be missing.\",\"\")"]
["C3 (iii)","Checks that the same date is recorded for both adults sharing an application ID","=IF(AND(COUNTIF(B$1:B$50000,B3)=2,AE3=TRUE),IF(Y3<>VLOOKUP(B3,B$1:AA$50000,CZ$1-1,FALSE),\"The disruption date should be the same for both adults under this application.\",\"\"),\"\")"]
["C3 (iv)","Checks that what has been entered under C3 is a (suitable) date","=IF(AND(Y3<>\"\",OR(ISNUMBER(Y3)=FALSE,AND(ISNUMBER(Y3)=TRUE,OR(Y3>Rdate,Y3<S3)))),\"Only suitable dates should be recorded here\",\"\")"]
["C4 (i)","If a case has gone on hold the restart date cannot be before the case went on hold","=IF(AND(Z3<>\"\",W3<>\"\",X3=2,W3>Z3),\"Process restart must be after C2a.\",\"\")"]
["C4 (ii)","It looks like the case has restarted but no date is recorded - the case went on hold and entries under other fields indicate progress has been made since","=IF(AND(X3=2,W3<MAX(M3:U3),Z3=\"\"),\"Process restart date is missing.\",\"\")"]
["C4 (iii)","Checks that the same date is recorded for both adults sharing an application ID","=IF(AND(COUNTIF(B$1:B$50000,B3)=2,AE3=TRUE),IF(Z3<>VLOOKUP(B3,B$1:AA$50000,DD$1-1,FALSE),\"The restart date should be the same for both adults under this application.\",\"\"),\"\")"]
["C4 (iv)","Checks that what has been entered under C4 is a (suitable) date","=IF(AND(Z3<>\"\",OR(ISNUMBER(Z3)=FALSE,AND(ISNUMBER(Z3)=TRUE,OR(Z3>Rdate,Z3<X3)))),\"Only suitable dates should be recorded here\",\"\")"]
["C4 (v)","Checks that a restart date has only been entered when the adoption process has been put on hold","=IF(AND(Z3<>\"\",X3<>2),\"C4 should only be populated if there is a 2 recorded under C2b.\",\"\")"]
["D1 (i)","Checks if a valid code has been entered under this fast-track flag field","=IF(OR(AA3=0,AA3=1),\"\",\"Fast track (D1) code can only be 0 or 1\")"]
["D2 (i)","Checks if a valid code has been entered under D2 for any approved adopter who does not have a match date or date of leaving the adoption process or who has a date the process resumes that is after the date of leaving the adoption process ","=IF(AND(DV3=TRUE,or(AB3=\"\",ISNUMBER(AB3)=FALSE,AB3<1,AB3>4)),\"Please provide an appropriate Family finding code (D2) for this adopter\",\"\")"]
["D2 (ii)","Checks that the same Family Finding code is recorded for both adults sharing an application ID","=IF(AND(COUNTIF(B$1:B$50000,B3)=2,AE3=TRUE),IF(AB3<>VLOOKUP(B3,B$1:AB$50000,DI$1-1,FALSE),\"The family finding code should be the same for both adults under this application.\",\"\"),\"\")"]
["D2 (iii)","Checks that code 4 has been entered under D2 for any adopter matched with a child but not yet placed for adoption","=IF(AND(R3<>\"\",S3=\"\",U3=\"\",AB3<>4),\"Family finding code (D2) should be '4' since adopters are matched with a child\",\"\")"]
["D2 (iiii)","Checks that code 3 has been entered under D2 for any adopter with 1 recorded under A11 (foster carer adoption) or under A12 (child placed under EP)","=IF(AND(OR(J3=1,K3=1),DV3=TRUE,AB3<>3),\"Family finding code (D2) should be '3' since adopters are linked with a specific child\",\"\")"]

{"sheet":"Lists","index":9,"n_rows":52,"n_cols":36,"rows_kept":52,"cut":false,"hidden":false,"merged":[]}
["Ethnic origin",null,null,"Gender",null,null,"Sexual orientation",null,null,"Relationship status",null,null,"Adoption Agencies",null,"Financial years",null,null,"Quarters ending",null,null,"Religion",null,null,"Yes/No",null,"Reason for leaving adoption process",null,null,"Analysis description","Analysis formulae",null,"EPP",null,null,"Family finding"]
["WBRI","White – British",null,0,"Not known (gender not recorded or unknown for unborn children)",null,"He","Heterosexual",null,"SIN","Single",null,"Adopt Birmingham","RAA32","2000-04-01","2000/01",null,"2014-06-30","2014/15 Q1",null,"Bu","Buddhist",null,0,"No",1,"(Prospective) adopter withdrew from the adoption process",null,"Currently in S1","=AND($N3<>\"\",COUNTA($O3:$S3,$U3,$Y3)=0,OR($W3=\"\",AND($W3<>\"\",$X3=2)))",null,0,"No",null,1,"Currently family finding for the family"]
["WIRI","White – Irish",null,1,"Male",null,"Ga","Gay",null,"MAR","Married",null,"Adopt Coast to Coast","RAA31","2001-04-01","2001/02",null,{"$f":"EDATE(R2+1,3)-1","v":"2014-09-30"},"2014/15 Q2",null,"Ch","Christian",null,1,"Yes",2,"The adoption process was put on hold",null,"S2 pending","=AND($O3<>\"\",COUNTA($P3:$S3,$U3,$Y3)=0,OR($W3=\"\",AND($W3<>\"\",$X3=2)))",null,1,"Yes: Child placed",null,2,"Not family finding – (expected to go) on hold or withdraw from the process"]
["WIRT","White – Traveller of Irish heritage",null,2,"Female",null,"Le","Lesbian",null,"CIV","Civil partnership",null,"Adopt East","RAA26","2002-04-01","2002/03",null,{"$f":"EDATE(R3+1,3)-1","v":"2014-12-31"},"2014/15 Q3",null,"Hi","Hindu",null,null,null,3,"The application was refused",null,"Currently in S2","=AND($P3<>\"\",COUNTA($Q3:$S3,$U3,$Y3)=0,OR($W3=\"\",AND($W3<>\"\",$X3=2)))",null,2,"Yes: No child placed yet",null,3,"Not family finding – child found but not yet formally matched at panel "]
["WROM","White – Gypsy/Roma",null,3,"Non-binary",null,"Bi","Bisexual",null,"CLM","Male/female partnership",null,"Adopt London East","RAA20","2003-04-01","2003/04",null,{"$f":"EDATE(R4+1,3)-1","v":"2015-03-31"},"2014/15 Q4",null,"Je","Jewish",null,null,null,null,null,null,"Not yet approved (as at 9 months before the reporting date)","=AND($Q3<>\"\",$Q3<=DS$1,NOT(AND($U3<>\"\",$U3<=DS$1)),NOT(AND($W3<>\"\",$W3<=DS$1,OR($X3=1,$X3=3))),OR($R3=\"\",$R3>DS$1,AND($R3<>\"\",$Y3<>\"\",$Y3>=$R3,$Y3<=DS$1)),OR($S3=\"\",$S3>DS$1,AND($S3<>\"\",$Y3<>\"\",$Y3>=$S3,$Y3<=DS$1)))",null,null,null,null,4,"Not family finding – other reason"]
["WOTH","Any other White background",null,4,"Transgender Man (Trans Man)",null,"Pa","Pansexual",null,"SSP","Same sex partnership",null,"Adopt London North","RAA22","2004-04-01","2004/05",null,"2015-06-30","2015/16 Q1",null,"Mu","Muslim",null,null,null,null,null,null,"Not yet approved (as at 6 months before the reporting date)","=AND($Q3<>\"\",$Q3<=DT$1,NOT(AND($U3<>\"\",$U3<=DT$1)),NOT(AND($W3<>\"\",$W3<=DT$1,OR($X3=1,$X3=3))),OR($R3=\"\",$R3>DT$1,AND($R3<>\"\",$Y3<>\"\",$Y3>=$R3,$Y3<=DT$1)),OR($S3=\"\",$S3>DT$1,AND($S3<>\"\",$Y3<>\"\",$Y3>=$S3,$Y3<=DT$1)))"]
["ABAN","Asian – Bangladeshi",null,5,"Transgender Woman (Trans Woman)",null,"Po","Polysexual",null,"OTH","Other",null,"Adopt London South","RAA19","2005-04-01","2005/06",null,"2015-09-30","2015/16 Q2",null,"No","None",null,null,null,null,null,null,"Not yet approved (as at 3 months before the reporting date)","=AND($Q3<>\"\",$Q3<=DU$1,NOT(AND($U3<>\"\",$U3<=DU$1)),NOT(AND($W3<>\"\",$W3<=DU$1,OR($X3=1,$X3=3))),OR($R3=\"\",$R3>DU$1,AND($R3<>\"\",$Y3<>\"\",$Y3>=$R3,$Y3<=DU$1)),OR($S3=\"\",$S3>DU$1,AND($S3<>\"\",$Y3<>\"\",$Y3>=$S3,$Y3<=DU$1)))"]
["AIND","Asian – Indian",null,6,"Other gender identity",null,"Qu","Queer",null,"REFU","Refused",null,"Adopt London West","RAA21","2006-04-01","2006/07",null,"2015-12-31","2015/16 Q3",null,"Ot","Other",null,null,null,null,null,null,"Not yet approved (as at the reporting date)","=AND($Q3<>\"\",$Q3<=DV$1,NOT(AND($U3<>\"\",$U3<=DV$1)),NOT(AND($W3<>\"\",$W3<=DV$1,OR($X3=1,$X3=3))),OR($R3=\"\",$R3>DV$1,AND($R3<>\"\",$Y3<>\"\",$Y3>=$R3,$Y3<=DV$1)),OR($S3=\"\",$S3>DV$1,AND($S3<>\"\",$Y3<>\"\",$Y3>=$S3,$Y3<=DV$1)))"]
["APKN","Asian – Pakistani",null,7,"Gender identity the same as sex registered at birth but no specific identity given",null,"Ot","Other",null,"NOBT","Information not yet obtained",null,"Adopt North East","RAA12","2007-04-01","2007/08",null,"2016-03-31","2015/16 Q4",null,"Re","Refused",null,null,null,null,null,null,"Waiting to be matched (as at 9 months before the reporting date)","=AND($Q3<>\"\",OR(R3=\"\",R3>DS$1),OR(T3=\"\",T3>DS$1,U3=2,U3=\"\"),$Q3<=DS$1,OR(AND($R3=\"\",OR($W3=\"\",$W3>DS$1,$X3=2),OR($S3=\"\",$S3>DS$1)),$R3>DS$1,AND($S3<>\"\",$Y3<>\"\",$S3<$Y3,$Y3<DS$1)))"]
["AOTH","Any other Asian background",null,8,"Gender identity different from sex registered at birth but no specific identity given",null,"Na","No information available",null,null,null,null,"Adopt South","RAA14","2008-04-01","2008/09",null,"2016-06-30","2016/17 Q1",null,"Na","No information available",null,null,null,null,null,null,"Waiting to be matched (as at 6 months before the reporting date)","=AND($Q3<>\"\",OR(S3=\"\",S3>DT$1),OR(U3=\"\",U3>DT$1,V3=2,V3=\"\"),$Q3<=DT$1,OR(AND($R3=\"\",OR($W3=\"\",$W3>DT$1,$X3=2),OR($S3=\"\",$S3>DT$1)),$R3>DT$1,AND($S3<>\"\",$Y3<>\"\",$S3<$Y3,$Y3<DT$1)))"]
["CHNE","Chinese",null,9,"Neither (indeterminate, i.e. unable to be classed as either male or female)",null,"Re","Refused",null,null,null,null,"Adopt South West","RAA11","2009-04-01","2009/10",null,"2016-09-30","2016/17 Q2",null,null,null,null,null,null,null,null,null,"Waiting to be matched (as at 3 months before the reporting date)","=AND($Q3<>\"\",OR(S3=\"\",S3>DU$1),OR(U3=\"\",U3>DU$1,V3=2,V3=\"\"),$Q3<=DU$1,OR(AND($R3=\"\",OR($W3=\"\",$W3>DU$1,$X3=2),OR($S3=\"\",$S3>DU$1)),$R3>DU$1,AND($S3<>\"\",$Y3<>\"\",$S3<$Y3,$Y3<DU$1)))"]
["BAFR","Black African",null,null,null,null,null,null,null,null,null,null,"Adopt Thames Valley","RAA6","2010-04-01","2010/11",null,"2016-12-31","2016/17 Q3",null,null,null,null,null,null,null,null,null,"Waiting to be matched (as at the reporting date)","=AND($Q3<>\"\",OR(U3=\"\",U3>DV$1),OR(W3=\"\",W3>DV$1,X3=2,X3=\"\"),$Q3<=DV$1,OR(AND($R3=\"\",OR($W3=\"\",$W3>DV$1,$X3=2),OR($S3=\"\",$S3>DV$1)),$R3>DV$1,AND($S3<>\"\",$Y3<>\"\",$S3<$Y3,$Y3<DV$1)))"]
["BCRB","Black Caribbean",null,null,null,null,null,null,null,null,null,null,"Adopters for Adoption","VAA3","2011-04-01","2011/12",null,"2017-03-31","2016/17 Q4",null,null,null,null,null,null,null,null,null,"Registration date","=IF($N3<>\"\",$N3,IF($P3<>\"\",$P3,\"\"))"]
["BOTH","Any other Black background",null,null,null,null,null,null,null,null,null,null,"Adoption @ Heart","RAA15","2012-04-01","2012/13",null,"2017-06-30","2017/18 Q1",null,null,null,null,null,null,null,null,null,"S1 completion time","=IF(AND($N3<>\"\",$O3<>\"\",$N3<$O3),DATEDIF($N3,$O3,\"m\"),\"\")"]
["MWAS","Mixed – White and Asian",null,null,null,null,null,null,null,null,null,null,"Adoption Central England","RAA8","2013-04-01","2013/14",null,"2017-09-30","2017/18 Q2",null,null,null,null,null,null,null,null,null,"S2 completion time","=IF(AND($P3<>\"\",$Q3<>\"\",$P3<$Q3),DATEDIF($P3,$Q3,\"m\"),\"\")"]
["MWBA","Mixed – White and Black African",null,null,null,null,null,null,null,null,null,null,"Adoption Connects","RAA16","2014-04-01","2014/15",null,"2017-12-31","2017/18 Q3",null,null,null,null,null,null,null,null,null,"Approval time (m)","=IF(AND($N3<>\"\",$Q3<>\"\",$N3<$Q3),DATEDIF($N3,$Q3,\"m\"),IF(AND($N3=\"\",$P3<>\"\",$Q3<>\"\",$P3<$Q3),DATEDIF($P3,$Q3,\"m\"),\"\"))"]
["MWBC","Mixed – White and Black Caribbean",null,null,null,null,null,null,null,null,null,null,"Adoption Counts","RAA3","2015-04-01","2015/16",null,"2018-03-31","2017/18 Q4",null,null,null,null,null,null,null,null,null,"Match time (m)","=IF(AND($Q3<>\"\",$R3<>\"\",$Q3<=$R3),DATEDIF($Q3,$R3,\"m\"),\"\")"]
["MOTH","Any other mixed background",null,null,false,null,null,null,null,null,null,null,"Adoption East Midlands","RAA17","2016-04-01","2016/17",null,"2018-06-30","2018/19 Q1",null,null,null,null,null,null,null,null,null,"Approved in reporting period within 6 months","=AND($Q3<>\"\",$Q3>=$DN$1,$Q3<=RDate,$DZ3<6)"]
["OOTH","Any other ethnic group",null,null,null,null,null,null,null,null,null,null,"Adoption Focus","VAA4","2017-04-01","2017/18",null,"2018-09-30","2018/19 Q2",null,null,null,null,null,null,null,null,null,"Approved in reporting period after 6 months","=AND($Q3<>\"\",$Q3>=$DN$1,$Q3<=RDate,$DZ3>=6)"]
["REFU","Refused",null,null,null,null,null,null,null,null,null,null,"Adoption in Merseyside","RAA9","2018-04-01","2018/19",null,"2018-12-31","2018/19 Q3",null,null,null,null,null,null,null,null,null,"Approved in reporting period no time","=AND($Q3<>\"\",$Q3>=$DN$1,$Q3<=RDate,$EB3=FALSE,$EC3=FALSE)"]
["NOBT","Information not yet obtained",null,null,null,null,null,null,null,null,null,null,"Adoption Lancashire & Blackpool","RAA24","2019-04-01","2019/20",null,"2019-03-31","2018/19 Q4",null,null,null,null,null,null,null,null,null,"Matched in reporting period within 3 months","=AND($R3<>\"\",$R3>=$DN$1,$R3<=RDate,$EA3<3)"]
[null,null,null,null,null,null,null,null,null,null,null,null,"Adoption Matters ","VAA5","2020-04-01","2020/21",null,"2019-06-30","2019/20 Q1",null,null,null,null,null,null,null,null,null,"Matched in reporting period after 3 months","=AND($R3<>\"\",$R3>=$DN$1,$R3<=RDate,$EA3>=3)"]
[null,null,null,null,null,null,null,null,null,null,null,null,"Adoption Now","RAA5","2021-04-01","2021/22",null,"2019-09-30","2019/20 Q2",null,null,null,null,null,null,null,null,null,"Matched in reporting period no time","=AND($R3<>\"\",$R3>=$DN$1,$R3<=RDate,$EE3=FALSE,$EF3=FALSE)"]
[null,null,null,null,null,null,null,null,null,null,null,null,"Adoption Partnership South East","RAA28","2022-04-01","2022/23",null,"2019-12-31","2019/20 Q3",null,null,null,null,null,null,null,null,null,"S1 time to Rdate","=IF(AND($N3<=RDate,$DL3=TRUE),DATEDIF($N3,RDate,\"m\"),\"\")"]
[null,null,null,null,null,null,null,null,null,null,null,null,"Adoption South East","RAA23","2023-04-01","2023/24",null,"2020-03-31","2019/20 Q4",null,null,null,null,null,null,null,null,null,"S2 pending time to Rdate","=IF(AND($O3<=RDate,$DM3=TRUE),DATEDIF($O3,RDate,\"m\"),\"\")"]
[null,null,null,null,null,null,null,null,null,null,null,null,"Adoption Tees Valley","RAA10","2024-04-01","2024/25",null,"2020-06-30","2020/21 Q1",null,null,null,null,null,null,null,null,null,"S2 time to Rdate","=IF(AND($P3<=RDate,$DN3=TRUE),DATEDIF($P3,RDate,\"m\"),\"\")"]
[null,null,null,null,null,null,null,null,null,null,null,null,"Adoption West","RAA13","2025-04-01","2025/26",null,"2020-09-30","2020/21 Q2",null,null,null,null,null,null,null,null,null,"Approved and waiting time to Rdate","=IF(AND($Q3<=RDate,$DV3=TRUE),DATEDIF($Q3,RDate,\"m\"),\"\")"]
[null,null,null,null,null,null,null,null,null,null,null,null,"Adoptionplus","VAA6","2026-04-01","2026/27",null,"2020-12-31","2020/21 Q3",null,null,null,null,null,null,null,null,null,"Placed time to Rdate","=IF(AND($S3<RDate,$S3<>\"\",$U3=\"\",OR($Y3=\"\",AND($Y3<>\"\",$S3>$Y3))),DATEDIF($S3,RDate,\"m\"),\"\")"]
[null,null,null,null,null,null,null,null,null,null,null,null,"ARC Adoption","VAA9",null,null,null,"2021-03-31","2020/21 Q4"]
[null,null,null,null,null,null,null,null,null,null,null,null,"Aspire","RAA2",null,null,null,"2021-06-30","2021/22 Q1"]
[null,null,null,null,null,null,null,null,null,null,null,null,"Barnardo's Adoption Midlands and South West","VAA11-5",null,null,null,"2021-09-30","2021/22 Q2"]
[null,null,null,null,null,null,null,null,null,null,null,null,"Barnardo's Adoption North England","VAA11-6",null,null,null,"2021-12-31","2021/22 Q3"]
[null,null,null,null,null,null,null,null,null,null,null,null,"Barnardo's London, East & South East","VAA11-1",null,null,null,"2022-03-31","2021/22 Q4"]
[null,null,null,null,null,null,null,null,null,null,null,null,"Buckinghamshire Adoption","RAA33",null,null,null,{"$f":"EDATE(R33+1,3)-1","v":"2022-06-30"},"2022/23 Q1"]
[null,null,null,null,null,null,null,null,null,null,null,null,"Cambridgeshire and Peterborough Adoption","RAA29",null,null,null,"2022-09-30","2022/23 Q2"]
[null,null,null,null,null,null,null,null,null,null,null,null,"Caritas Care","VAA13",null,null,null,"2022-12-31","2022/23 Q3"]
[null,null,null,null,null,null,null,null,null,null,null,null,"CCS Adoption Limited","VAA14",null,null,null,"2023-03-31","2022/23 Q4"]
[null,null,null,null,null,null,null,null,null,null,null,null,"Cumbria Adoption","RAA34",null,null,null,{"$f":"EDATE(R37+1,3)-1","v":"2023-06-30"},"2023/24 Q1"]
[null,null,null,null,null,null,null,null,null,null,null,null,"Diagrama Adoption","VAA12",null,null,null,"2023-09-30","2023/24 Q2"]
[null,null,null,null,null,null,null,null,null,null,null,null,"Family Adoption Links","RAA27",null,null,null,"2023-12-31","2023/24 Q3"]
[null,null,null,null,null,null,null,null,null,null,null,null,"Family Futures","VAA21",null,null,null,"2024-03-31","2023/24 Q4"]
[null,null,null,null,null,null,null,null,null,null,null,null,"Intercountry Adoption Centre","VAA22",null,null,null,{"$f":"EDATE(R41+1,3)-1","v":"2024-06-30"},"2024/25 Q1"]
[null,null,null,null,null,null,null,null,null,null,null,null,"Nugent","VAA24",null,null,null,"2024-09-30","2024/25 Q2"]
[null,null,null,null,null,null,null,null,null,null,null,null,"One Adoption North and Humber","RAA7",null,null,null,"2024-12-31","2024/25 Q3"]
[null,null,null,null,null,null,null,null,null,null,null,null,"One Adoption South Yorkshire","RAA30",null,null,null,"2025-03-31","2024/25 Q4"]
[null,null,null,null,null,null,null,null,null,null,null,null,"One Adoption West Yorkshire","RAA1",null,null,null,"2025-06-30","2025/26 Q1"]
[null,null,null,null,null,null,null,null,null,null,null,null,"Parents and Children Together","VAA25",null,null,null,"2025-09-30","2025/26 Q2"]
[null,null,null,null,null,null,null,null,null,null,null,null,"SSAFA","VAA27",null,null,null,"2025-12-31","2025/26 Q3"]
[null,null,null,null,null,null,null,null,null,null,null,null,"Thomas Coram Foundation for Children (delivering Ambitious for Adoption RAA)","VAA15",null,null,null,"2026-03-31","2025/26 Q4"]
[null,null,null,null,null,null,null,null,null,null,null,null,"Together for Adoption","RAA4"]
[null,null,null,null,null,null,null,null,null,null,null,null,"Together4Children","RAA25"]
[null,null,null,null,null,null,null,null,null,null,null,null,"Yorkshire Adoption Agency","VAA34"]